What is my error?
Understand any error. Find the cause. Fix it faster.
or paste your full error / stack trace and we'll analyze it →
Browse by category
All categories →bar = errors documented (vs. the biggest category) · = has errors trending right now
What people are fixing right now
See all trending →HTTP 400 Bad Request
The server could not understand the request because its syntax, headers or body are malformed or invalid.
HTTP 500 Internal Server Error
The server hit an unexpected condition — usually an unhandled exception or misconfiguration in the application.
HTTP 403 Forbidden
The server understood the request but refuses to authorize it — you (or the server process) are not allowed to access this resour…
npm ERR! code EOVERRIDE — Override for x conflicts with direct dependency
An "overrides" entry sets a different version for a package you also depend on directly.
npm ERR! code E404 — 404 Not Found: package@version is not in this registry
npm asked the registry for a package (or version) that doesn’t exist there — a typo, a private/scoped package without auth, or th…
fatal: You have not concluded your merge (MERGE_HEAD exists). Please, commit your changes before you merge.
A merge is still in progress — conflicts were resolved (or not) but not committed.
GitHub Actions: Error: Unable to download artifact(s): Artifact not found for name: build
`download-artifact` could not find an artifact with that name in the run (or repository) — it was never uploaded, named different…
MySQL ERROR 1064 (42000): You have an error in your SQL syntax
MySQL couldn’t parse the query. The text after “near” shows where parsing failed.
Jenkins: Still waiting to schedule task — Waiting for next available executor / 'agent1' is offline
A Jenkins build is queued because no executor with the required label is free or the agent is offline.
GitHub Actions: Error: This request has been automatically failed because it uses a deprecated version of `actions/upload-artifact: v3`
Since January 2025 the v3 artifact actions no longer work — upload and download steps fail until you move to v4.
npm ERR! code EOVERRIDE — Override for x conflicts with direct dependency
An "overrides" entry sets a different version for a package you also depend on directly.
TypeError: Failed to execute 'json' on 'Response': body stream already read
A fetch Response body was consumed twice (e.g. calling .text() then .json()).
[nodemon] app crashed - waiting for file changes before starting...
Your app threw an error on startup; nodemon is waiting for a file change to retry.
Thread 1: signal SIGABRT (app crashes with "libc++abi: terminating")
The app deliberately aborted — an uncaught exception, failed assertion or fatalError. The console above the crash has the real me…
ERROR: prepared statement "s1" already exists (PgBouncer transaction mode)
Named prepared statements collided — typically because PgBouncer in transaction pooling mode hands connections between clients.
System has not been booted with systemd as init system (PID 1). Can't operate.
You ran systemctl inside an environment without systemd as PID 1 — a Docker container or older WSL.
Jenkins: Still waiting to schedule task — Waiting for next available executor / 'agent1' is offline
A Jenkins build is queued because no executor with the required label is free or the agent is offline.
Cloudflare Error 1015: You are being rate limited
The site’s Cloudflare rate-limiting rule blocked you for sending too many requests in a short time.
Most looked-up errors
1,531 errors documentedHTTP 500 Internal Server Error
The server hit an unexpected condition — usually an unhandled exception or misconfiguration in the application.
HTTP 403 Forbidden
The server understood the request but refuses to authorize it — you (or the server process) are not allowed to access this resour…
HTTP 400 Bad Request
The server could not understand the request because its syntax, headers or body are malformed or invalid.
ORA-00933: SQL command not properly ended
Oracle found extra clauses or syntax it doesn’t support at the end of a statement.
WordPress: There Has Been a Critical Error on This Website
A PHP fatal error (usually from a plugin or theme) stopped WordPress; the real error is in the debug log or recovery-mode email.
MySQL ERROR 1064 (42000): You have an error in your SQL syntax
MySQL couldn’t parse the query. The text after “near” shows where parsing failed.
Could not load file or assembly 'X, Version=…' or one of its dependencies
The runtime couldn’t find or load a referenced DLL — missing from the output, wrong version, or wrong platform (x86/x64).
TypeError: Cannot read properties of undefined (reading 'x')
You tried to access a property on a value that is `undefined` (or `null`) — usually data that hasn’t loaded yet or a wrong proper…
Warning: Undefined array key / Undefined index
Your code reads an array key that doesn’t exist — common with `$_GET`, `$_POST` and decoded JSON.
The application was unable to start correctly (0xc000007b)
A program loaded a DLL of the wrong architecture (32-bit vs 64-bit) or a corrupted runtime library.
MySQL ERROR 1045 (28000): Access denied for user
MySQL rejected the login — wrong password, wrong user/host combination, or the user doesn’t exist.
java.lang.NullPointerException
Code called a method or accessed a field on a reference that is `null`.
🧠 Analyze my error
Paste a raw error, log line, HTTP response or stack trace. We detect the error code, platform and request, match it against our knowledge base, and tell you the likely cause and what to check first.
403 Forbidden nginx/1.24.0 GET /api/usersAnalyze an error
⚖️ Confusing pairs, explained
- 301 vs 302: Permanent vs Temporary Redirect
- 401 vs 403: Unauthorized vs Forbidden
- 400 vs 422: Bad Request vs Unprocessable Content
- Cloudflare 525 vs 526: SSL Handshake Failed vs Invalid SSL Certificate
- 406 vs 415: Not Acceptable vs Unsupported Media Type
- Authentication vs Authorization