Error map
measured with an infinity maximum height Jetpack Compose: Vertically scrollable component was measured with an infinity maximum height constraints, which is disallowed
Android · layer 1, On your device
Centre: this error. First ring: errors it is linked with (8). Outer ring: what those are linked with. Colours show the layer of a request each error belongs to. Click any dot to re-centre the map on it; hover to follow its connections. The centre dot opens the error page.
Directly related (8)
adb: device unauthorized. This adb server's $ADB_VENDOR_KEYS is not set
The phone hasn’t accepted your computer’s RSA key for USB debugging yet.
Error: Too many re-renders. React limits the number of renders to prevent an infinite loop.
A state update runs during render, which triggers another render, which updates state again — forever.
AAPT: error: resource x (aka y) not found — Android resource linking failed
A layout, manifest or style references a resource (drawable, string, style, attribute) that doesn’t exist in the module or its de…
ActivityNotFoundException: Unable to find explicit activity class; have you declared this activity in your AndroidManifest.xml?
An Intent targets an Activity that isn’t declared in the manifest, or an implicit intent has no app to handle it.
Flutter: A RenderFlex overflowed by x pixels on the right/bottom
A Row or Column’s children need more space than available, so Flutter draws the yellow-black overflow stripes.
AAPT: error: resource android:attr/lStar not found
A dependency (androidx.core 1.7+) uses an attribute from Android 12 (API 31), but your module compiles against an older compileSd…
ANR: Application Not Responding (Input dispatching timed out)
The main thread was blocked for about 5 seconds (input) or a broadcast/service took too long, so Android showed “App isn’t respon…
adb: no devices/emulators found / error: device not found
adb can’t see any connected device or running emulator.
Two steps away (23)
Android: INSTALL_FAILED_UPDATE_INCOMPATIBLE
An app with the same package name but a different signing key is already installed on the device.
INSTALL_FAILED_INSUFFICIENT_STORAGE: Failure [INSTALL_FAILED_INSUFFICIENT_STORAGE]
The device or emulator doesn’t have enough free internal storage to install the APK.
INSTALL_FAILED_TEST_ONLY: installPackageLI
The APK is marked testOnly (built by Android Studio’s Run button), so normal installs refuse it.
RangeError: Maximum call stack size exceeded
A function called itself (directly or indirectly) too many times — usually infinite recursion.
Error: Objects are not valid as a React child
You tried to render a plain object (or a Promise/Date) directly in JSX; React can only render strings, numbers, elements and arra…
Warning: Each child in a list should have a unique "key" prop
When rendering a list with `.map()`, each element needs a stable, unique `key` so React can track items between renders.
Gradle: Could not resolve all files for configuration / Could not resolve dependency
Gradle couldn’t download a dependency — wrong coordinates/version, missing repository, offline mode, or network/proxy issues.
Manifest merger failed: android:exported needs to be explicitly specified
Targeting Android 12 (API 31)+ requires `android:exported` on every activity, service or receiver that has an intent-filter.
Duplicate class X found in modules A and B
Two dependencies ship the same class — typically old Android Support libraries mixed with AndroidX, or Kotlin stdlib-jdk7/jdk8 ve…
adb server version (41) doesn't match this client (39); killing...
Two different adb binaries are running — e.g. Android Studio’s SDK adb and another one on PATH (Homebrew, Genymotion, older SDK).
java.lang.SecurityException: Permission Denial ... requires android.permission.X
The app called an API that needs a permission it hasn’t declared or the user hasn’t granted at runtime.
WindowManager$BadTokenException: Unable to add window -- token null is not valid; is your activity running?
A dialog or popup was shown with a context whose Activity is finishing/destroyed, or with the Application context.
Flutter: setState() called after dispose(): _MyState#1a2b3 (lifecycle state: defunct, not mounted)
An async callback (network, timer, stream) finished after the widget was removed and then called setState.
Dart/Flutter: Null check operator used on a null value
The ! operator was applied to a variable that was null at runtime.
Gradle: Unsupported class file major version / Android Gradle plugin requires Java 17 to run
The JDK running Gradle doesn’t match what the Gradle version or Android Gradle Plugin (AGP) supports.
Kubernetes: Pod stuck in Pending — FailedScheduling: 0/3 nodes are available
The scheduler can’t find a node that satisfies the pod’s resource requests, selectors, taints or volume constraints.
Kubernetes: Pod Evicted — The node was low on resource: memory / ephemeral-storage
The kubelet removed the pod because its node ran short of memory or disk.
HTTP 504 Gateway Timeout
A proxy or gateway waited too long for the upstream server to respond and gave up.
Cloudflare Error 524: A Timeout Occurred
Cloudflare connected to the origin, but the origin didn’t send an HTTP response within 100 seconds.
HTTP 304 Not Modified
The cached copy is still valid, so the server sends no body and the client reuses its cache.
INSTALL_FAILED_USER_RESTRICTED: Install canceled by user (Xiaomi/MIUI, Oppo, Vivo)
The phone’s manufacturer layer blocked installs over USB — Xiaomi/MIUI, Oppo/ColorOS and Vivo require extra developer settings.
IllegalStateException: Can not perform this action after onSaveInstanceState (fragment transaction)
A FragmentTransaction (or DialogFragment.show/navigation) ran after the Activity saved its state, typically from an async callbac…
IllegalStateException: Fragment x not attached to a context / not attached to an activity
Code called requireContext()/requireActivity()/getString() after the Fragment was detached — usually in an async callback.
Map another error
Popular: 4035004000xC000007BTypeErrorCritical error404NullPointerException