Error map

500 HTTP 500 Internal Server Error

HTTP · layer 2, Network

Open the full error page →

Centre: this error. First ring: errors it is linked with (12). Outer ring: what those are linked with. Colours show the layer of a request each error belongs to. Click any dot to re-centre the map on it; hover to follow its connections. The centre dot opens the error page.

500 — HTTP 500 Internal Server Error (HTTP)500Critical error — WordPress: There Has Been a Critical Error on This Website (WordPress)Critical error404 — HTTP 404 Not Found (HTTP)404Parse error — PHP Parse error: syntax error, unexpected … (PHP)Parse errorCall to undefined function — PHP Fatal error: Uncaught Error: Call to undefined function (PHP)Call to undefined f…503 — HTTP 503 Service Unavailable (HTTP)503520 — Cloudflare Error 520: Web Server Returned an Unknown Error (Cloudflare)520Uncaught Exception — Fatal error: Uncaught Exception: message in file.php:12 (PHP)Uncaught ExceptionDB connection — WordPress: Error Establishing a Database Connection (WordPress)DB connection500.30 — HTTP Error 500.30 - ASP.NET Core app failed to start (.NET)500.30504 — HTTP 504 Gateway Timeout (HTTP)504508 — HTTP 508 Loop Detected (Resource Limit Is Reached) (HTTP)508Malformed Lambda proxy response — API Gateway {"message": "Internal server error"} 502 — Malformed Lambda proxy response (AWS)Malformed Lambda pr…Allowed memory size exhausted — PHP Fatal error: Allowed memory size of X bytes exhausted (PHP)Allowed memory size…Maintenance mode — WordPress: Briefly unavailable for scheduled maintenance. Check back in a minute. (WordPress)Maintenance modeLink expired — WordPress: The link you followed has expired (WordPress)Link expired403 — HTTP 403 Forbidden (HTTP)403405 — HTTP 405 Method Not Allowed (HTTP)405410 — HTTP 410 Gone (HTTP)4101064 — MySQL ERROR 1064 (42000): You have an error in your SQL syntax (MySQL)1064IndentationError — IndentationError: unexpected indent / expected an indented block (Python)IndentationErrorCannot redeclare — Fatal error: Cannot redeclare function foo() (previously declared in …) (PHP)Cannot redeclareClass not found — PHP Fatal error: Uncaught Error: Class "X" not found (PHP)Class not foundHeaders already sent — Warning: Cannot modify header information - headers already sent (PHP)Headers already sentCall to member function on null — Fatal error: Uncaught Error: Call to a member function x() on null (PHP)Call to member func…CrashLoopBackOff — Kubernetes: CrashLoopBackOff (Kubernetes)CrashLoopBackOff429 — HTTP 429 Too Many Requests (HTTP)429502 — HTTP 502 Bad Gateway (HTTP)502521 — Cloudflare Error 521: Web Server Is Down (Cloudflare)521301 — HTTP 301 Moved Permanently (HTTP)301CERTIFICATE_VERIFY_FAILED — SSL: CERTIFICATE_VERIFY_FAILED / unable to get local issuer certificate (API)CERTIFICATE_VERIFY_…IllegalStateException — java.lang.IllegalStateException (Java)IllegalStateExcepti…ArithmeticException — java.lang.ArithmeticException: / by zero (Java)ArithmeticExceptionNoSuchElementException — java.util.NoSuchElementException: No value present (Java)NoSuchElementExcept…1045 — MySQL ERROR 1045 (28000): Access denied for user (MySQL)10452002 — MySQL ERROR 2002 (HY000): Can't connect to local MySQL server through socket (MySQL)20021040 — MySQL ERROR 1040 (08004): Too many connections (MySQL)1040App Service Application Error — Azure App Service: ":( Application Error" / container didn’t respond to HTTP pings (Azure)App Service Applica…InvalidOperationException — InvalidOperationException: Unable to resolve service for type 'X' while attempting to activate 'Y' (.NET)InvalidOperationExc…FileNotFoundException assembly — Could not load file or assembly 'X, Version=…' or one of its dependencies (.NET)FileNotFoundExcepti…408 — HTTP 408 Request Timeout (HTTP)408499 — HTTP 499 Client Closed Request (Nginx) (HTTP)499Maximum execution time — PHP Fatal error: Maximum execution time of 30 seconds exceeded (PHP)Maximum execution t…SkuNotAvailable — Azure: SkuNotAvailable / QuotaExceeded when creating a VM or resource (Azure)SkuNotAvailable1114 — MySQL ERROR 1114 (HY000): The table 'x' is full (MySQL)111453300 — FATAL: sorry, too many clients already / remaining connection slots are reserved for non-replication superuser connections (PostgreSQL)53300Task timed out — AWS Lambda: Task timed out after X seconds (AWS)Task timed outRuntime.ImportModuleError — Runtime.ImportModuleError: Unable to import module 'lambda_function': No module named 'x' (AWS)Runtime.ImportModul…Runtime.HandlerNotFound — Runtime.HandlerNotFound: index.handler is undefined or not exported (AWS)Runtime.HandlerNotF…

Directly related (12)

Critical errorWordPress

WordPress: There Has Been a Critical Error on This Website

A PHP fatal error (usually from a plugin or theme) stopped WordPress; the real error is in the debug log or recovery-mode email.

404HTTP

HTTP 404 Not Found

The server can’t find anything at the requested URL.

Parse errorPHP

PHP Parse error: syntax error, unexpected …

PHP can’t parse the file because of a syntax mistake — the real error is often on the line before the one reported.

Call to undefined functionPHP

PHP Fatal error: Uncaught Error: Call to undefined function

PHP can’t find the function you called — usually a missing extension, missing include, or namespace issue.

503HTTP

HTTP 503 Service Unavailable

The server is temporarily unable to handle the request — overloaded, in maintenance, or has no healthy backends.

520Cloudflare

Cloudflare Error 520: Web Server Returned an Unknown Error

Cloudflare connected to your origin, but the origin returned an empty, unknown or invalid response.

Uncaught ExceptionPHP

Fatal error: Uncaught Exception: message in file.php:12

An exception was thrown and nothing caught it, so PHP stopped the script.

DB connectionWordPress

WordPress: Error Establishing a Database Connection

WordPress can’t connect to its MySQL/MariaDB database with the credentials in wp-config.php, or the database server is down.

500.30.NET

HTTP Error 500.30 - ASP.NET Core app failed to start

IIS/Azure’s ASP.NET Core Module launched your app but it crashed during startup.

504HTTP

HTTP 504 Gateway Timeout

A proxy or gateway waited too long for the upstream server to respond and gave up.

508HTTP

HTTP 508 Loop Detected (Resource Limit Is Reached)

Either the server detected an infinite loop (WebDAV) or — much more often — a cPanel/CloudLinux host is saying your account hit i…

Malformed Lambda proxy responseAWS

API Gateway {"message": "Internal server error"} 502 — Malformed Lambda proxy response

The Lambda behind an API Gateway proxy integration returned something that isn’t the required {statusCode, headers, body} shape,…

Two steps away (36)

Allowed memory size exhaustedPHP

PHP Fatal error: Allowed memory size of X bytes exhausted

The script tried to use more memory than PHP’s `memory_limit` allows.

Maintenance modeWordPress

WordPress: Briefly unavailable for scheduled maintenance. Check back in a minute.

An update was interrupted and WordPress left its `.maintenance` file behind, so the site stays in maintenance mode.

Link expiredWordPress

WordPress: The link you followed has expired

Usually an upload (theme, plugin, media) larger than PHP’s upload/post limits — WordPress receives an empty request and shows thi…

403HTTP

HTTP 403 Forbidden

The server understood the request but refuses to authorize it — you (or the server process) are not allowed to access this resour…

405HTTP

HTTP 405 Method Not Allowed

The URL exists, but it doesn’t accept the HTTP method you used (e.g. POST to a GET-only route).

410HTTP

HTTP 410 Gone

The resource used to exist but was intentionally and permanently removed, with no forwarding address.

1064MySQL

MySQL ERROR 1064 (42000): You have an error in your SQL syntax

MySQL couldn’t parse the query. The text after “near” shows where parsing failed.

IndentationErrorPython

IndentationError: unexpected indent / expected an indented block

Python’s block structure is broken — inconsistent indentation or mixed tabs and spaces.

Cannot redeclarePHP

Fatal error: Cannot redeclare function foo() (previously declared in …)

The same function (or class) was defined twice — usually a file included more than once.

Class not foundPHP

PHP Fatal error: Uncaught Error: Class "X" not found

PHP couldn’t load the class — autoloading failed, the namespace is wrong, or the dependency isn’t installed.

Headers already sentPHP

Warning: Cannot modify header information - headers already sent

You called `header()`, `setcookie()` or `session_start()` after output had already been sent to the browser.

Call to member function on nullPHP

Fatal error: Uncaught Error: Call to a member function x() on null

Code called a method on a variable that is null instead of an object.

CrashLoopBackOffKubernetes

Kubernetes: CrashLoopBackOff

The container starts, crashes (or exits), and Kubernetes keeps restarting it with increasing back-off delays.

429HTTP

HTTP 429 Too Many Requests

You’ve hit a rate limit — too many requests in a given time window. Slow down and retry later.

502HTTP

HTTP 502 Bad Gateway

A proxy or gateway (Nginx, load balancer, CDN) got an invalid response — or no response — from the upstream server behind it.

521Cloudflare

Cloudflare Error 521: Web Server Is Down

Cloudflare couldn’t connect to your origin — the connection was refused.

301HTTP

HTTP 301 Moved Permanently

The resource has a new permanent URL; clients and search engines should use the address in the Location header from now on.

CERTIFICATE_VERIFY_FAILEDAPI

SSL: CERTIFICATE_VERIFY_FAILED / unable to get local issuer certificate

The client couldn’t verify the server’s TLS certificate chain, so it refused the HTTPS connection.

IllegalStateExceptionJava

java.lang.IllegalStateException

A method was called when the object wasn’t in the right state for it.

ArithmeticExceptionJava

java.lang.ArithmeticException: / by zero

Integer division or modulo by zero.

NoSuchElementExceptionJava

java.util.NoSuchElementException: No value present

Code asked for an element that doesn’t exist — Optional.get() on empty, iterator.next() past the end, Scanner with no input.

1045MySQL

MySQL ERROR 1045 (28000): Access denied for user

MySQL rejected the login — wrong password, wrong user/host combination, or the user doesn’t exist.

2002MySQL

MySQL ERROR 2002 (HY000): Can't connect to local MySQL server through socket

The client couldn’t reach the MySQL server — it isn’t running, or the client is looking for the socket/port in the wrong place.

1040MySQL

MySQL ERROR 1040 (08004): Too many connections

MySQL reached `max_connections` and refuses new clients.

App Service Application ErrorAzure

Azure App Service: ":( Application Error" / container didn’t respond to HTTP pings

App Service started your app but it crashed or never listened on the expected port.

InvalidOperationException.NET

InvalidOperationException: Unable to resolve service for type 'X' while attempting to activate 'Y'

ASP.NET Core’s dependency injection container can’t build Y because one of its constructor dependencies (X) was never registered.

FileNotFoundException assembly.NET

Could not load file or assembly 'X, Version=…' or one of its dependencies

The runtime couldn’t find or load a referenced DLL — missing from the output, wrong version, or wrong platform (x86/x64).

408HTTP

HTTP 408 Request Timeout

The server closed the connection because the client took too long to send the complete request.

499HTTP

HTTP 499 Client Closed Request (Nginx)

Nginx-specific code logged when the client disconnected before the server finished responding.

Maximum execution timePHP

PHP Fatal error: Maximum execution time of 30 seconds exceeded

The script ran longer than `max_execution_time` and PHP stopped it.

SkuNotAvailableAzure

Azure: SkuNotAvailable / QuotaExceeded when creating a VM or resource

The VM size isn’t offered in that region/zone for your subscription, or you’ve hit the vCPU quota.

1114MySQL

MySQL ERROR 1114 (HY000): The table 'x' is full

MySQL couldn’t extend the table — disk full, a size limit, or a MEMORY table hitting max_heap_table_size.

53300PostgreSQL

FATAL: sorry, too many clients already / remaining connection slots are reserved for non-replication superuser connections

PostgreSQL reached max_connections.

Task timed outAWS

AWS Lambda: Task timed out after X seconds

The function ran longer than its configured timeout (default 3 seconds) and Lambda stopped it.

Runtime.ImportModuleErrorAWS

Runtime.ImportModuleError: Unable to import module 'lambda_function': No module named 'x'

Lambda couldn’t load your handler file or one of its dependencies — the package is missing from the deployment zip/layer or the h…

Runtime.HandlerNotFoundAWS

Runtime.HandlerNotFound: index.handler is undefined or not exported

Lambda loaded the file but couldn’t find the function named in the handler setting.