Error map

FileNotFoundException assembly Could not load file or assembly 'X, Version=…' or one of its dependencies

.NET · layer 4, Application & API

Open the full error page →

Centre: this error. First ring: errors it is linked with (11). Outer ring: what those are linked with. Colours show the layer of a request each error belongs to. Click any dot to re-centre the map on it; hover to follow its connections. The centre dot opens the error page.

FileNotFoundException assembly — Could not load file or assembly 'X, Version=…' or one of its dependencies (.NET)FileNotFoun…0xC000007B — The application was unable to start correctly (0xc000007b) (Windows)0xC000007BClassNotFoundException — java.lang.ClassNotFoundException / NoClassDefFoundError (Java)ClassNotFoundExcept…module MIME type — Failed to load module script: Expected a JavaScript module script but the server responded with a MIME type of "text/html" (JavaScript)module MIME type500.30 — HTTP Error 500.30 - ASP.NET Core app failed to start (.NET)500.30ChunkLoadError — ChunkLoadError: Loading chunk 123 failed. (JavaScript)ChunkLoadErrorOPcache stale code — PHP still runs old code after deploy (OPcache not reset) (PHP)OPcache stale codeNETSDK1045 — error NETSDK1045: The current .NET SDK does not support targeting .NET 8.0. Either target .NET 7.0 or lower, or use a version of the .NET SDK that supports .NET 8.0 (.NET)NETSDK1045You must install or update .NET to run this application — The framework 'Microsoft.NETCore.App', version '8.0.0' (x64) was not found. You must install or update .NET to run this application (.NET)You must install or…NU1605 — error NU1605: Detected package downgrade: X from 8.0.1 to 8.0.0. Reference the package directly from the project to select a different version (.NET)NU1605System.Drawing.Common is not supported — PlatformNotSupportedException: System.Drawing.Common is not supported on this platform (.NET)System.Drawing.Comm…MIME type not executable — Refused to execute script from 'x' because its MIME type ('text/html') is not executable (JavaScript)MIME type not execu…0x80070643 — Windows Error 0x80070643: Fatal error during installation (Windows)0x80070643VCRUNTIME140.dll — VCRUNTIME140.dll was not found / MSVCP140.dll is missing (Windows)VCRUNTIME140.dll0xC0000005 — The application was unable to start correctly (0xc0000005) / Exception code 0xc0000005 access violation (Windows)0xC0000005Could not resolve — Gradle: Could not resolve all files for configuration / Could not resolve dependency (Android)Could not resolveClass not found — PHP Fatal error: Uncaught Error: Class "X" not found (PHP)Class not foundModuleNotFoundError — ModuleNotFoundError: No module named 'x' (Python)ModuleNotFoundErrorApp Service Application Error — Azure App Service: ":( Application Error" / container didn’t respond to HTTP pings (Azure)App Service Applica…Unexpected token < — SyntaxError: Unexpected token '<' (HTML served instead of JavaScript) (JavaScript)Unexpected token <Refused to apply style from — Console: Refused to apply style from 'https://…/style.css' because its MIME type ('text/html') is not a supported stylesheet MIME type (Browser)Refused to apply st…500 — HTTP 500 Internal Server Error (HTTP)500InvalidOperationException — InvalidOperationException: Unable to resolve service for type 'X' while attempting to activate 'Y' (.NET)InvalidOperationExc…ExceptionInInitializerError — java.lang.ExceptionInInitializerError (Java)ExceptionInInitiali…invalid selector — DOMException: Failed to execute 'querySelector' on 'Document': 'x' is not a valid selector (JavaScript)invalid selectorCan't resolve 'fs' — Module not found: Can't resolve 'fs' (Next.js / webpack 5) (React)Can't resolve 'fs'Module parse failed — Module parse failed: Unexpected token. You may need an appropriate loader to handle this file type (React)Module parse failedPrimary script unknown — FastCGI sent in stderr: "Primary script unknown" (PHP)Primary script unkn…ELIFECYCLE — npm ERR! code ELIFECYCLE / Command failed with exit code 1 (npm)ELIFECYCLEgyp ERR! — gyp ERR! build error / node-gyp rebuild failed (npm)gyp ERR!COPY failed — COPY failed: file not found in build context / "/app/x": not found (Docker)COPY failedUnsupportedClassVersionError — java.lang.UnsupportedClassVersionError: class file version 61.0, this version of the Java Runtime only recognizes up to 55.0 (Java)UnsupportedClassVer…ERESOLVE — npm ERR! code ERESOLVE — unable to resolve dependency tree (npm)ERESOLVEMODULE_NOT_FOUND — Error: Cannot find module 'x' (MODULE_NOT_FOUND) (Node.js)MODULE_NOT_FOUNDImportError — ImportError: cannot import name 'x' from 'y' (Python)ImportErrorImagePullBackOff — Kubernetes: ImagePullBackOff / ErrImagePull (Kubernetes)ImagePullBackOffexec format error — exec /usr/local/bin/docker-entrypoint.sh: exec format error (Docker)exec format errorGD missing — Fatal error: Uncaught Error: Call to undefined function imagecreatefromjpeg() (PHP)GD missingService worker registration failed — Console: Failed to register a ServiceWorker: A bad HTTP response code (404) was received when fetching the script (Browser)Service worker regi…DevTools failed to load source map — DevTools: Failed to load source map — Could not load content for https://…/app.js.map: HTTP error: status code 404 (Browser)DevTools failed to …

Directly related (11)

0xC000007BWindows

The application was unable to start correctly (0xc000007b)

A program loaded a DLL of the wrong architecture (32-bit vs 64-bit) or a corrupted runtime library.

ClassNotFoundExceptionJava

java.lang.ClassNotFoundException / NoClassDefFoundError

The JVM couldn’t find a class on the classpath at runtime.

module MIME typeJavaScript

Failed to load module script: Expected a JavaScript module script but the server responded with a MIME type of "text/html"

A or dynamic import got HTML back instead of JavaScript.

500.30.NET

HTTP Error 500.30 - ASP.NET Core app failed to start

IIS/Azure’s ASP.NET Core Module launched your app but it crashed during startup.

ChunkLoadErrorJavaScript

ChunkLoadError: Loading chunk 123 failed.

A lazily loaded JavaScript chunk couldn’t be downloaded — usually because a new deployment removed the old hashed files.

OPcache stale codePHP

PHP still runs old code after deploy (OPcache not reset)

OPcache keeps serving cached bytecode, so changes uploaded to the server don’t take effect.

NETSDK1045.NET

error NETSDK1045: The current .NET SDK does not support targeting .NET 8.0. Either target .NET 7.0 or lower, or use a version of the .NET SDK that supports .NET 8.0

The installed .NET SDK is older than the project’s TargetFramework.

You must install or update .NET to run this application.NET

The framework 'Microsoft.NETCore.App', version '8.0.0' (x64) was not found. You must install or update .NET to run this application

The machine doesn’t have the .NET runtime version the app was built for (framework-dependent deployment).

NU1605.NET

error NU1605: Detected package downgrade: X from 8.0.1 to 8.0.0. Reference the package directly from the project to select a different version

A direct reference requests a lower version than a dependency needs, and NuGet treats the downgrade as an error.

System.Drawing.Common is not supported.NET

PlatformNotSupportedException: System.Drawing.Common is not supported on this platform

Since .NET 6, System.Drawing.Common only works on Windows; on Linux/macOS (including Docker) it throws.

MIME type not executableJavaScript

Refused to execute script from 'x' because its MIME type ('text/html') is not executable

The browser fetched a script but the server labelled it text/html (usually an error page), so it refused to run it.

Two steps away (28)

0x80070643Windows

Windows Error 0x80070643: Fatal error during installation

An MSI-based installer or update (often Defender definitions, .NET or the WinRE update KB5034441) failed during installation.

VCRUNTIME140.dllWindows

VCRUNTIME140.dll was not found / MSVCP140.dll is missing

The program needs the Microsoft Visual C++ 2015–2022 Redistributable, which isn’t installed (or is damaged).

0xC0000005Windows

The application was unable to start correctly (0xc0000005) / Exception code 0xc0000005 access violation

A program tried to read or write memory it doesn’t own and Windows stopped it — buggy software, bad drivers/plugins, security sof…

Could not resolveAndroid

Gradle: Could not resolve all files for configuration / Could not resolve dependency

Gradle couldn’t download a dependency — wrong coordinates/version, missing repository, offline mode, or network/proxy issues.

Class not foundPHP

PHP Fatal error: Uncaught Error: Class "X" not found

PHP couldn’t load the class — autoloading failed, the namespace is wrong, or the dependency isn’t installed.

ModuleNotFoundErrorPython

ModuleNotFoundError: No module named 'x'

Python can’t find the module you import — it isn’t installed in the interpreter/virtualenv that’s running, or the import path is…

App Service Application ErrorAzure

Azure App Service: ":( Application Error" / container didn’t respond to HTTP pings

App Service started your app but it crashed or never listened on the expected port.

Unexpected token <JavaScript

SyntaxError: Unexpected token '<' (HTML served instead of JavaScript)

The browser loaded a .js file but received HTML (an error page or the SPA index.html).

Refused to apply style fromBrowser

Console: Refused to apply style from 'https://…/style.css' because its MIME type ('text/html') is not a supported stylesheet MIME type

The stylesheet URL returned something that is not CSS — usually a 404/HTML error page — and `X-Content-Type-Options: nosniff` mak…

500HTTP

HTTP 500 Internal Server Error

The server hit an unexpected condition — usually an unhandled exception or misconfiguration in the application.

InvalidOperationException.NET

InvalidOperationException: Unable to resolve service for type 'X' while attempting to activate 'Y'

ASP.NET Core’s dependency injection container can’t build Y because one of its constructor dependencies (X) was never registered.

ExceptionInInitializerErrorJava

java.lang.ExceptionInInitializerError

A static initializer (static block or static field) threw an exception while the class was loading.

invalid selectorJavaScript

DOMException: Failed to execute 'querySelector' on 'Document': 'x' is not a valid selector

The CSS selector string is invalid — often an ID starting with a digit or containing special characters.

Can't resolve 'fs'React

Module not found: Can't resolve 'fs' (Next.js / webpack 5)

A Node.js built-in (fs, path, crypto, net) is imported into code that runs in the browser bundle.

Module parse failedReact

Module parse failed: Unexpected token. You may need an appropriate loader to handle this file type

Webpack found syntax it can’t parse because no loader is configured for that file (JSX, TypeScript, CSS, or modern syntax in node…

Primary script unknownPHP

FastCGI sent in stderr: "Primary script unknown"

Nginx passed a script path to PHP-FPM that PHP-FPM couldn’t find — usually a wrong SCRIPT_FILENAME or root.

ELIFECYCLEnpm

npm ERR! code ELIFECYCLE / Command failed with exit code 1

An npm script (build, start, test, postinstall) exited with an error. ELIFECYCLE is only the wrapper — the real error is printed…

gyp ERR!npm

gyp ERR! build error / node-gyp rebuild failed

A dependency with native C/C++ code couldn’t compile — missing build tools, Python, or an unsupported Node version.

COPY failedDocker

COPY failed: file not found in build context / "/app/x": not found

The Dockerfile COPY refers to a path outside the build context, excluded by .dockerignore, or relative to the wrong directory.

UnsupportedClassVersionErrorJava

java.lang.UnsupportedClassVersionError: class file version 61.0, this version of the Java Runtime only recognizes up to 55.0

Code compiled for a newer Java version is running on an older JVM.

ERESOLVEnpm

npm ERR! code ERESOLVE — unable to resolve dependency tree

npm 7+ found conflicting peer dependency requirements and refuses to install a broken tree.

MODULE_NOT_FOUNDNode.js

Error: Cannot find module 'x' (MODULE_NOT_FOUND)

Node can’t resolve the module path — the package isn’t installed, or a relative path/extension is wrong.

ImportErrorPython

ImportError: cannot import name 'x' from 'y'

The module was found, but the name you’re importing from it doesn’t exist — usually a version change or a circular import.

ImagePullBackOffKubernetes

Kubernetes: ImagePullBackOff / ErrImagePull

The node can’t pull the container image — wrong name/tag, missing registry credentials, or registry unreachable.

exec format errorDocker

exec /usr/local/bin/docker-entrypoint.sh: exec format error

The container tried to run a binary built for a different CPU architecture (arm64 vs amd64) — or a script with a broken shebang /…

GD missingPHP

Fatal error: Uncaught Error: Call to undefined function imagecreatefromjpeg()

The GD extension (or its JPEG/WebP support) isn’t installed for the PHP version serving the site.

Service worker registration failedBrowser

Console: Failed to register a ServiceWorker: A bad HTTP response code (404) was received when fetching the script

The browser could not fetch, parse or install the service worker script, or the page is not allowed to register one (HTTPS and sc…

DevTools failed to load source mapBrowser

DevTools: Failed to load source map — Could not load content for https://…/app.js.map: HTTP error: status code 404

DevTools could not download the `.map` file that a script or stylesheet points to, so you see minified code instead of your sourc…