Error map

GD missing Fatal error: Uncaught Error: Call to undefined function imagecreatefromjpeg()

PHP · layer 4, Application & API

Open the full error page →

Centre: this error. First ring: errors it is linked with (12). Outer ring: what those are linked with. Colours show the layer of a request each error belongs to. Click any dot to re-centre the map on it; hover to follow its connections. The centre dot opens the error page.

GD missing — Fatal error: Uncaught Error: Call to undefined function imagecreatefromjpeg() (PHP)GD missingCall to undefined function — PHP Fatal error: Uncaught Error: Call to undefined function (PHP)Call to undefined f…intl missing — Class "NumberFormatter" not found / The "intl" PHP extension is required (PHP)intl missingcould not find driver — PDOException: could not find driver (PHP)could not find driv…OSProvisioningTimedOut — Azure VM: OSProvisioningTimedOut — OS Provisioning for VM did not finish in the allotted time (Azure)OSProvisioningTimed…1011 — Cloudflare Error 1011: Access denied (Hotlinking denied) (Cloudflare)1011ImagePullBackOff — Kubernetes: ImagePullBackOff / ErrImagePull (Kubernetes)ImagePullBackOffexec format error — exec /usr/local/bin/docker-entrypoint.sh: exec format error (Docker)exec format errorconflict: unable to remove repository reference — conflict: unable to remove repository reference (must force) - container is using its referenced image (Docker)conflict: unable to…image has dependent child images — conflict: unable to delete image (cannot be forced) - image has dependent child images (Docker)image has dependent…invalid reference format — docker: invalid reference format (repository name must be lowercase) (Docker)invalid reference f…42883 function — ERROR: function x(text) does not exist — No function matches the given name and argument types (PostgreSQL)42883 functionSystem.Drawing.Common is not supported — PlatformNotSupportedException: System.Drawing.Common is not supported on this platform (.NET)System.Drawing.Comm…500 — HTTP 500 Internal Server Error (HTTP)500Class not found — PHP Fatal error: Uncaught Error: Class "X" not found (PHP)Class not foundHeaders already sent — Warning: Cannot modify header information - headers already sent (PHP)Headers already sentextension not available — ERROR: could not open extension control file ".../postgis.control": No such file or directory (PostgreSQL)extension not avail…create extension denied — ERROR: permission denied to create extension "x" — Must be superuser to create this extension. (PostgreSQL)create extension de…ITMS-90206 — ITMS-90206: Invalid Bundle. The bundle at 'App.appex' contains disallowed file 'Frameworks' (iOS)ITMS-902061040 — MySQL ERROR 1040 (08004): Too many connections (MySQL)1040Communications link failure — com.mysql.cj.jdbc.exceptions.CommunicationsException: Communications link failure (Java)Communications link…HikariCP timeout — HikariPool-1 - Connection is not available, request timed out after 30000ms (Java)HikariCP timeoutnext/image hostname — Error: Invalid src prop on `next/image`, hostname "x" is not configured under images in your `next.config.js` (React)next/image hostnameInstance reachability check failed — EC2 status check failed: Instance reachability check failed (1/2 checks passed) (AWS)Instance reachabili…manifest unknown — manifest for image:tag not found: manifest unknown (Docker)manifest unknown403 — HTTP 403 Forbidden (HTTP)4031020 — Cloudflare Error 1020: Access Denied (Cloudflare)1020no matching manifest — no matching manifest for linux/arm64/v8 in the manifest list entries (Docker)no matching manifestCrashLoopBackOff — Kubernetes: CrashLoopBackOff (Kubernetes)CrashLoopBackOffFailedScheduling — Kubernetes: Pod stuck in Pending — FailedScheduling: 0/3 nodes are available (Kubernetes)FailedSchedulingCannotPullContainerError — ECS task stopped: CannotPullContainerError: pull image manifest has been retried ... / ref pull has been retried (AWS)CannotPullContainer…command not found — bash: command not found (Linux)command not foundCOPY failed — COPY failed: file not found in build context / "/app/x": not found (Docker)COPY failedexec no such file or directory — exec /docker-entrypoint.sh: no such file or directory (CRLF line endings / missing interpreter) (Docker)exec no such file o…ENOSPC — no space left on device (Docker / Linux) (Docker)ENOSPCmax depth exceeded — Error response from daemon: max depth exceeded (too many image layers) (Docker)max depth exceededpull access denied — pull access denied for image, repository does not exist or may require 'docker login' (Docker)pull access deniedis not running — Error response from daemon: Container X is not running (Docker)is not runningdocker-compose: command not found — docker-compose: command not found / 'compose' is not a docker command (Docker)docker-compose: com…ArgumentCountError — Fatal error: Uncaught ArgumentCountError: Too few arguments to function foo(), 1 passed and exactly 2 expected (PHP)ArgumentCountErrorTypeError arguments — TypeError: f() takes 1 positional argument but 2 were given (Python)TypeError argumentsTypeError missing arg — TypeError: f() missing 1 required positional argument: 'x' (Python)TypeError missing a…FileNotFoundException assembly — Could not load file or assembly 'X, Version=…' or one of its dependencies (.NET)FileNotFoundExcepti…InvalidImageName — Pod status InvalidImageName: couldn't parse image reference (Kubernetes)InvalidImageNameYou must install or update .NET to run this application — The framework 'Microsoft.NETCore.App', version '8.0.0' (x64) was not found. You must install or update .NET to run this application (.NET)You must install or…

Directly related (12)

Call to undefined functionPHP

PHP Fatal error: Uncaught Error: Call to undefined function

PHP can’t find the function you called — usually a missing extension, missing include, or namespace issue.

intl missingPHP

Class "NumberFormatter" not found / The "intl" PHP extension is required

Code uses the intl extension (NumberFormatter, Collator, IntlDateFormatter) but it isn’t installed.

could not find driverPHP

PDOException: could not find driver

The PDO driver for your database (pdo_mysql, pdo_pgsql, pdo_sqlite) isn’t installed or enabled.

OSProvisioningTimedOutAzure

Azure VM: OSProvisioningTimedOut — OS Provisioning for VM did not finish in the allotted time

The VM booted but its guest agent didn’t report provisioning success in time — usually a generalisation problem with a custom ima…

1011Cloudflare

Cloudflare Error 1011: Access denied (Hotlinking denied)

An image or file is being loaded from another site, and Cloudflare Hotlink Protection blocked it.

ImagePullBackOffKubernetes

Kubernetes: ImagePullBackOff / ErrImagePull

The node can’t pull the container image — wrong name/tag, missing registry credentials, or registry unreachable.

exec format errorDocker

exec /usr/local/bin/docker-entrypoint.sh: exec format error

The container tried to run a binary built for a different CPU architecture (arm64 vs amd64) — or a script with a broken shebang /…

conflict: unable to remove repository referenceDocker

conflict: unable to remove repository reference (must force) - container is using its referenced image

You tried to delete an image that a container — even a stopped one — still uses.

image has dependent child imagesDocker

conflict: unable to delete image (cannot be forced) - image has dependent child images

Other images were built on top of this one, so Docker won’t delete it by ID.

invalid reference formatDocker

docker: invalid reference format (repository name must be lowercase)

Docker couldn’t parse the image name — uppercase letters, spaces, an empty variable, or a misplaced option.

42883 functionPostgreSQL

ERROR: function x(text) does not exist — No function matches the given name and argument types

PostgreSQL found no function with that name and argument types — wrong types, missing extension, or schema not in search_path.

System.Drawing.Common is not supported.NET

PlatformNotSupportedException: System.Drawing.Common is not supported on this platform

Since .NET 6, System.Drawing.Common only works on Windows; on Linux/macOS (including Docker) it throws.

Two steps away (32)

500HTTP

HTTP 500 Internal Server Error

The server hit an unexpected condition — usually an unhandled exception or misconfiguration in the application.

Class not foundPHP

PHP Fatal error: Uncaught Error: Class "X" not found

PHP couldn’t load the class — autoloading failed, the namespace is wrong, or the dependency isn’t installed.

Headers already sentPHP

Warning: Cannot modify header information - headers already sent

You called `header()`, `setcookie()` or `session_start()` after output had already been sent to the browser.

extension not availablePostgreSQL

ERROR: could not open extension control file ".../postgis.control": No such file or directory

CREATE EXTENSION failed because the extension’s files aren’t installed on the server.

create extension deniedPostgreSQL

ERROR: permission denied to create extension "x" — Must be superuser to create this extension.

Your role lacks the privilege to create that extension.

ITMS-90206iOS

ITMS-90206: Invalid Bundle. The bundle at 'App.appex' contains disallowed file 'Frameworks'

An app extension (or framework) embeds its own Frameworks folder; only the main app may embed frameworks.

1040MySQL

MySQL ERROR 1040 (08004): Too many connections

MySQL reached `max_connections` and refuses new clients.

Communications link failureJava

com.mysql.cj.jdbc.exceptions.CommunicationsException: Communications link failure

The MySQL JDBC driver couldn’t reach the database (or the connection dropped).

HikariCP timeoutJava

HikariPool-1 - Connection is not available, request timed out after 30000ms

The connection pool was exhausted — all connections were busy for 30 seconds.

next/image hostnameReact

Error: Invalid src prop on `next/image`, hostname "x" is not configured under images in your `next.config.js`

next/image refuses to optimize images from domains not allowed in next.config.js.

Instance reachability check failedAWS

EC2 status check failed: Instance reachability check failed (1/2 checks passed)

AWS can reach the host, but the operating system inside the instance isn’t responding — kernel panic, full disk, broken network c…

manifest unknownDocker

manifest for image:tag not found: manifest unknown

The repository exists, but the tag you asked for doesn’t — it was never pushed, was deleted, or is misspelled.

403HTTP

HTTP 403 Forbidden

The server understood the request but refuses to authorize it — you (or the server process) are not allowed to access this resour…

1020Cloudflare

Cloudflare Error 1020: Access Denied

A Cloudflare firewall/WAF custom rule blocked the request — the visitor’s IP, country, user agent or request pattern matched a bl…

no matching manifestDocker

no matching manifest for linux/arm64/v8 in the manifest list entries

The image has no build for your CPU architecture — typically pulling an amd64-only image on an Apple Silicon Mac or ARM server.

CrashLoopBackOffKubernetes

Kubernetes: CrashLoopBackOff

The container starts, crashes (or exits), and Kubernetes keeps restarting it with increasing back-off delays.

FailedSchedulingKubernetes

Kubernetes: Pod stuck in Pending — FailedScheduling: 0/3 nodes are available

The scheduler can’t find a node that satisfies the pod’s resource requests, selectors, taints or volume constraints.

CannotPullContainerErrorAWS

ECS task stopped: CannotPullContainerError: pull image manifest has been retried ... / ref pull has been retried

The ECS task couldn’t pull its image — no network route to the registry, missing ECR permissions, or a wrong image tag.

command not foundLinux

bash: command not found

The shell can’t find an executable with that name in any directory on your PATH.

COPY failedDocker

COPY failed: file not found in build context / "/app/x": not found

The Dockerfile COPY refers to a path outside the build context, excluded by .dockerignore, or relative to the wrong directory.

exec no such file or directoryDocker

exec /docker-entrypoint.sh: no such file or directory (CRLF line endings / missing interpreter)

The entrypoint file exists, but the kernel can’t run it — almost always Windows CRLF line endings in the script, or a shebang poi…

ENOSPCDocker

no space left on device (Docker / Linux)

The disk (or inode table) is full — Docker images, build cache, logs and volumes are common culprits.

max depth exceededDocker

Error response from daemon: max depth exceeded (too many image layers)

The image has more layers than the storage driver allows (127 for overlay2), usually from repeatedly committing containers or ver…

pull access deniedDocker

pull access denied for image, repository does not exist or may require 'docker login'

Docker couldn’t pull the image: the name or tag is wrong, the repository is private and you’re not logged in, or it doesn’t exist…

is not runningDocker

Error response from daemon: Container X is not running

You tried to exec into or interact with a container that has stopped.

docker-compose: command not foundDocker

docker-compose: command not found / 'compose' is not a docker command

Your system has only one of the two Compose flavours: the old docker-compose (v1) binary or the newer docker compose (v2) plugin.

ArgumentCountErrorPHP

Fatal error: Uncaught ArgumentCountError: Too few arguments to function foo(), 1 passed and exactly 2 expected

A function was called with fewer arguments than it requires.

TypeError argumentsPython

TypeError: f() takes 1 positional argument but 2 were given

A function was called with more positional arguments than it accepts — very often a method missing `self`.

TypeError missing argPython

TypeError: f() missing 1 required positional argument: 'x'

A function was called without a required parameter.

FileNotFoundException assembly.NET

Could not load file or assembly 'X, Version=…' or one of its dependencies

The runtime couldn’t find or load a referenced DLL — missing from the output, wrong version, or wrong platform (x86/x64).

InvalidImageNameKubernetes

Pod status InvalidImageName: couldn't parse image reference

The image field in the pod spec isn’t a valid image reference, so the kubelet can’t even try to pull it.

You must install or update .NET to run this application.NET

The framework 'Microsoft.NETCore.App', version '8.0.0' (x64) was not found. You must install or update .NET to run this application

The machine doesn’t have the .NET runtime version the app was built for (framework-dependent deployment).