Error map

docker-compose: command not found docker-compose: command not found / 'compose' is not a docker command

Docker · layer 6, Platform & cloud

Open the full error page →

Centre: this error. First ring: errors it is linked with (12). Outer ring: what those are linked with. Colours show the layer of a request each error belongs to. Click any dot to re-centre the map on it; hover to follow its connections. The centre dot opens the error page.

docker-compose: command not found — docker-compose: command not found / 'compose' is not a docker command (Docker)docker-comp…JAVA_HOME not set — ERROR: JAVA_HOME is not set and no 'java' command could be found in your PATH. (Java)JAVA_HOME not setaws: error: argument — aws: error: argument command: Invalid choice / Unknown options (AWS)aws: error: argumentis not running — Error response from daemon: Container X is not running (Docker)is not runningENOENT — npm ERR! enoent ENOENT: no such file or directory, open '/path/package.json' (npm)ENOENTTarget container is not a DOM element — Error: createRoot(...): Target container is not a DOM element. (React)Target container is…missing the MySQL extension — WordPress: Your PHP installation appears to be missing the MySQL extension which is required by WordPress (WordPress)missing the MySQL e…ReactDOM.render deprecated — Warning: ReactDOM.render is no longer supported in React 18. Use createRoot instead. (React)ReactDOM.render dep…the input device is not a TTY — the input device is not a TTY (Docker)the input device is…not a git repository — fatal: not a git repository (or any of the parent directories): .git (Git)not a git repositorycompose validation — docker compose: services.x Additional property y is not allowed / yaml: line N: mapping values are not allowed (Docker)compose validationinvalid reference format — docker: invalid reference format (repository name must be lowercase) (Docker)invalid reference f…Pool overlaps — Error response from daemon: Pool overlaps with other one on this address space (Docker)Pool overlapscommand not found — bash: command not found (Linux)command not foundUnsupported class file major version — Gradle: Unsupported class file major version / Android Gradle plugin requires Java 17 to run (Android)Unsupported class f…UnsupportedClassVersionError — java.lang.UnsupportedClassVersionError: class file version 61.0, this version of the Java Runtime only recognizes up to 55.0 (Java)UnsupportedClassVer…author identity unknown — Author identity unknown *** Please tell me who you are. (Git)author identity unk…yarn not found — yarn: command not found (npm)yarn not foundYou must specify a region — You must specify a region. You can also configure your region by running "aws configure" (NoRegionError) (AWS)You must specify a …port is already allocated — Docker: Bind for 0.0.0.0:80 failed: port is already allocated (Docker)port is already all…Conflict container name — Conflict. The container name "/x" is already in use by container … (Docker)Conflict container …CannotPullContainerError — ECS task stopped: CannotPullContainerError: pull image manifest has been retried ... / ref pull has been retried (AWS)CannotPullContainer…ENOENT — Error: ENOENT: no such file or directory (Node.js)ENOENTpathspec did not match — error: pathspec 'x' did not match any file(s) known to git (Git)pathspec did not ma…Filename too long — error: unable to create file x: Filename too long (Windows) (Git)Filename too longinvalid selector — DOMException: Failed to execute 'querySelector' on 'Document': 'x' is not a valid selector (JavaScript)invalid selectorResizeObserver loop — ResizeObserver loop completed with undelivered notifications. (JavaScript)ResizeObserver loopInvalid DOM property — Warning: Invalid DOM property `class`. Did you mean `className`? (React)Invalid DOM propertyDB connection — WordPress: Error Establishing a Database Connection (WordPress)DB connectionadb server version doesn't match — adb server version (41) doesn't match this client (39); killing... (Android)adb server version …SDK location not found — SDK location not found. Define a valid SDK location with an ANDROID_HOME environment variable or by setting the sdk.dir path in local.properties (Android)SDK location not fo…caching_sha2_password — Authentication plugin 'caching_sha2_password' cannot be loaded (MySQL)caching_sha2_passwo…defaultProps deprecated — Warning: Support for defaultProps will be removed from function components in a future major release. (React)defaultProps deprec…findDOMNode deprecated — Warning: findDOMNode is deprecated and will be removed in the next major release. (React)findDOMNode depreca…shallow update not allowed — ! [remote rejected] main -> main (shallow update not allowed) (Git)shallow update not …github-actions[bot] 403 — remote: Permission to owner/repo.git denied to github-actions[bot]. fatal: unable to access … The requested URL returned error: 403 (Git)github-actions[bot]…npm ci out of sync — npm ERR! `npm ci` can only install packages when your package.json and package-lock.json are in sync (npm)npm ci out of syncnon-fast-forward — Git: ! [rejected] … (fetch first) — error: failed to push some refs (Git)non-fast-forwardpublickey — Git: Permission denied (publickey). fatal: Could not read from remote repository. (Git)publickeyCOPY failed — COPY failed: file not found in build context / "/app/x": not found (Docker)COPY failedIndentationError — IndentationError: unexpected indent / expected an indented block (Python)IndentationErrornetwork not found — Error response from daemon: network X not found (Docker)network not founddepends on undefined service — service "web" depends on undefined service "db": invalid compose project (Docker)depends on undefine…exec format error — exec /usr/local/bin/docker-entrypoint.sh: exec format error (Docker)exec format errorGD missing — Fatal error: Uncaught Error: Call to undefined function imagecreatefromjpeg() (PHP)GD missingnext/image hostname — Error: Invalid src prop on `next/image`, hostname "x" is not configured under images in your `next.config.js` (React)next/image hostnamethe attribute version is obsolete — WARN: the attribute `version` is obsolete, it will be ignored (Docker)the attribute versi…unhealthy — Docker container is unhealthy (health check failing) (Docker)unhealthyiptables: No chain/target/match — driver failed programming external connectivity on endpoint: iptables: No chain/target/match by that name (Docker)iptables: No chain/…

Directly related (12)

JAVA_HOME not setJava

ERROR: JAVA_HOME is not set and no 'java' command could be found in your PATH.

Build tools (Gradle, Maven, Android tools) can’t find a JDK.

aws: error: argumentAWS

aws: error: argument command: Invalid choice / Unknown options

The AWS CLI doesn’t recognise the command or option — usually CLI v1 vs v2 differences, an old CLI version, or a typo.

is not runningDocker

Error response from daemon: Container X is not running

You tried to exec into or interact with a container that has stopped.

ENOENTnpm

npm ERR! enoent ENOENT: no such file or directory, open '/path/package.json'

npm ran in a directory without a package.json.

Target container is not a DOM elementReact

Error: createRoot(...): Target container is not a DOM element.

The element passed to createRoot/render doesn’t exist when the script runs.

missing the MySQL extensionWordPress

WordPress: Your PHP installation appears to be missing the MySQL extension which is required by WordPress

PHP doesn’t have the mysqli extension loaded, so WordPress can’t talk to the database.

ReactDOM.render deprecatedReact

Warning: ReactDOM.render is no longer supported in React 18. Use createRoot instead.

The app uses the legacy root API, so React 18 features (concurrent rendering, automatic batching) are disabled.

the input device is not a TTYDocker

the input device is not a TTY

docker run/exec was called with -t (allocate a terminal) in a context with no terminal — CI, cron, a pipe or a script.

not a git repositoryGit

fatal: not a git repository (or any of the parent directories): .git

You ran a Git command outside a Git working tree.

compose validationDocker

docker compose: services.x Additional property y is not allowed / yaml: line N: mapping values are not allowed

The compose file is invalid YAML or uses a key Compose doesn’t recognise at that level (usually an indentation mistake).

invalid reference formatDocker

docker: invalid reference format (repository name must be lowercase)

Docker couldn’t parse the image name — uppercase letters, spaces, an empty variable, or a misplaced option.

Pool overlapsDocker

Error response from daemon: Pool overlaps with other one on this address space

Docker tried to create a network whose subnet clashes with an existing Docker network (or a VPN/host route).

Two steps away (36)

command not foundLinux

bash: command not found

The shell can’t find an executable with that name in any directory on your PATH.

Unsupported class file major versionAndroid

Gradle: Unsupported class file major version / Android Gradle plugin requires Java 17 to run

The JDK running Gradle doesn’t match what the Gradle version or Android Gradle Plugin (AGP) supports.

UnsupportedClassVersionErrorJava

java.lang.UnsupportedClassVersionError: class file version 61.0, this version of the Java Runtime only recognizes up to 55.0

Code compiled for a newer Java version is running on an older JVM.

author identity unknownGit

Author identity unknown *** Please tell me who you are.

Git doesn’t know your name and email for commits.

yarn not foundnpm

yarn: command not found

Yarn isn’t installed (or not enabled through Corepack) on this machine.

You must specify a regionAWS

You must specify a region. You can also configure your region by running "aws configure" (NoRegionError)

No region is configured for the CLI/SDK call.

port is already allocatedDocker

Docker: Bind for 0.0.0.0:80 failed: port is already allocated

Another container or host process already publishes that host port.

Conflict container nameDocker

Conflict. The container name "/x" is already in use by container …

A container (running or stopped) already has that name; Docker won’t create a second one with the same name.

CannotPullContainerErrorAWS

ECS task stopped: CannotPullContainerError: pull image manifest has been retried ... / ref pull has been retried

The ECS task couldn’t pull its image — no network route to the registry, missing ECR permissions, or a wrong image tag.

ENOENTNode.js

Error: ENOENT: no such file or directory

A file or directory the program tried to open doesn’t exist at that path.

pathspec did not matchGit

error: pathspec 'x' did not match any file(s) known to git

Git couldn’t find the file or branch name you referenced.

Filename too longGit

error: unable to create file x: Filename too long (Windows)

Windows’ 260-character path limit blocked Git from creating a file.

invalid selectorJavaScript

DOMException: Failed to execute 'querySelector' on 'Document': 'x' is not a valid selector

The CSS selector string is invalid — often an ID starting with a digit or containing special characters.

ResizeObserver loopJavaScript

ResizeObserver loop completed with undelivered notifications.

A ResizeObserver callback changed layout in a way that triggered another resize in the same frame.

Invalid DOM propertyReact

Warning: Invalid DOM property `class`. Did you mean `className`?

HTML attribute names were used in JSX instead of their React/DOM property names.

DB connectionWordPress

WordPress: Error Establishing a Database Connection

WordPress can’t connect to its MySQL/MariaDB database with the credentials in wp-config.php, or the database server is down.

adb server version doesn't matchAndroid

adb server version (41) doesn't match this client (39); killing...

Two different adb binaries are running — e.g. Android Studio’s SDK adb and another one on PATH (Homebrew, Genymotion, older SDK).

SDK location not foundAndroid

SDK location not found. Define a valid SDK location with an ANDROID_HOME environment variable or by setting the sdk.dir path in local.properties

Gradle doesn’t know where the Android SDK is installed.

caching_sha2_passwordMySQL

Authentication plugin 'caching_sha2_password' cannot be loaded

An old MySQL client/driver can’t use MySQL 8’s default authentication plugin.

defaultProps deprecatedReact

Warning: Support for defaultProps will be removed from function components in a future major release.

A function component (often inside a library) uses Component.defaultProps.

findDOMNode deprecatedReact

Warning: findDOMNode is deprecated and will be removed in the next major release.

A component (often an old library like react-transition-group v1, react-draggable) uses findDOMNode, which StrictMode flags and R…

shallow update not allowedGit

! [remote rejected] main -> main (shallow update not allowed)

You pushed from a shallow clone to a remote that doesn’t accept shallow history.

github-actions[bot] 403Git

remote: Permission to owner/repo.git denied to github-actions[bot]. fatal: unable to access … The requested URL returned error: 403

A GitHub Actions workflow tried to push but the GITHUB_TOKEN doesn’t have write permission.

npm ci out of syncnpm

npm ERR! `npm ci` can only install packages when your package.json and package-lock.json are in sync

package-lock.json doesn’t match package.json, so npm ci refuses to install.

non-fast-forwardGit

Git: ! [rejected] … (fetch first) — error: failed to push some refs

The remote branch has commits you don’t have locally, so Git refuses to overwrite them. Pull (merge or rebase) first, then push.

publickeyGit

Git: Permission denied (publickey). fatal: Could not read from remote repository.

SSH authentication to GitHub/GitLab/Bitbucket failed — no key, wrong key, or the key isn’t added to your account.

COPY failedDocker

COPY failed: file not found in build context / "/app/x": not found

The Dockerfile COPY refers to a path outside the build context, excluded by .dockerignore, or relative to the wrong directory.

IndentationErrorPython

IndentationError: unexpected indent / expected an indented block

Python’s block structure is broken — inconsistent indentation or mixed tabs and spaces.

network not foundDocker

Error response from daemon: network X not found

The container or Compose project refers to a Docker network that doesn’t exist (any more).

depends on undefined serviceDocker

service "web" depends on undefined service "db": invalid compose project

A service lists depends_on (or links/networks) for a service name that isn’t defined in the Compose file(s) being used.

exec format errorDocker

exec /usr/local/bin/docker-entrypoint.sh: exec format error

The container tried to run a binary built for a different CPU architecture (arm64 vs amd64) — or a script with a broken shebang /…

GD missingPHP

Fatal error: Uncaught Error: Call to undefined function imagecreatefromjpeg()

The GD extension (or its JPEG/WebP support) isn’t installed for the PHP version serving the site.

next/image hostnameReact

Error: Invalid src prop on `next/image`, hostname "x" is not configured under images in your `next.config.js`

next/image refuses to optimize images from domains not allowed in next.config.js.

the attribute version is obsoleteDocker

WARN: the attribute `version` is obsolete, it will be ignored

A harmless Compose v2 warning: the top-level version: line in docker-compose.yml is no longer used.

unhealthyDocker

Docker container is unhealthy (health check failing)

The container is running, but its HEALTHCHECK command keeps failing, so Docker (and dependent services) consider it unhealthy.

iptables: No chain/target/matchDocker

driver failed programming external connectivity on endpoint: iptables: No chain/target/match by that name

Docker’s iptables rules were wiped (firewalld/ufw reload, iptables flush) while Docker was running, so it can’t publish ports.