Error map

unhealthy Docker container is unhealthy (health check failing)

Docker · layer 6, Platform & cloud

Open the full error page →

Centre: this error. First ring: errors it is linked with (12). Outer ring: what those are linked with. Colours show the layer of a request each error belongs to. Click any dot to re-centre the map on it; hover to follow its connections. The centre dot opens the error page.

unhealthy — Docker container is unhealthy (health check failing) (Docker)unhealthyis not running — Error response from daemon: Container X is not running (Docker)is not runningdocker-compose: command not found — docker-compose: command not found / 'compose' is not a docker command (Docker)docker-compose: com…Liveness probe failed — Liveness probe failed ... Container will be restarted (also Startup probe failed) (Kubernetes)Liveness probe fail…ACR unauthorized — Azure Container Registry: unauthorized: authentication required, visit https://aka.ms/acr/authorization (AKS ErrImagePull 401) (Azure)ACR unauthorizedReadiness probe failed — Readiness probe failed: HTTP probe failed with statuscode: 503 / connect: connection refused (Kubernetes)Readiness probe fai…Container failed to start — Cloud Run: The user-provided container failed to start and listen on the port defined provided by the PORT=8080 environment variable (Google Cloud / Firebase)Container failed to…Conflict container name — Conflict. The container name "/x" is already in use by container … (Docker)Conflict container …compose validation — docker compose: services.x Additional property y is not allowed / yaml: line N: mapping values are not allowed (Docker)compose validationPool overlaps — Error response from daemon: Pool overlaps with other one on this address space (Docker)Pool overlapsdepends on undefined service — service "web" depends on undefined service "db": invalid compose project (Docker)depends on undefine…Restarting (1) — Docker container keeps restarting (Restarting (1) x seconds ago) (Docker)Restarting (1)Health checks failed — ALB target unhealthy: Health checks failed with these codes: [404] / Request timed out (AWS)Health checks failedport is already allocated — Docker: Bind for 0.0.0.0:80 failed: port is already allocated (Docker)port is already all…CannotPullContainerError — ECS task stopped: CannotPullContainerError: pull image manifest has been retried ... / ref pull has been retried (AWS)CannotPullContainer…Essential container in task exited — ECS: Essential container in task exited (task keeps stopping) (AWS)Essential container…not a git repository — fatal: not a git repository (or any of the parent directories): .git (Git)not a git repositorycommand not found — bash: command not found (Linux)command not foundJAVA_HOME not set — ERROR: JAVA_HOME is not set and no 'java' command could be found in your PATH. (Java)JAVA_HOME not setCrashLoopBackOff — Kubernetes: CrashLoopBackOff (Kubernetes)CrashLoopBackOffOOMKilled — Kubernetes: OOMKilled (exit code 137) (Kubernetes)OOMKilledis waiting to start — Error from server (BadRequest): container "x" in pod "y" is waiting to start: ContainerCreating (Kubernetes)is waiting to startImagePullBackOff — Kubernetes: ImagePullBackOff / ErrImagePull (Kubernetes)ImagePullBackOffEROFS — npm ERR! code EROFS — EROFS: read-only file system (npm)EROFSECR token expired — denied: Your authorization token has expired. Reauthenticate and try again. (Amazon ECR) (AWS)ECR token expiredno endpoints — Service has no endpoints (no endpoints available for service / Endpoints: <none>) (Kubernetes)no endpointsProgressDeadlineExceeded — deployment "x" exceeded its progress deadline (ProgressDeadlineExceeded) (Kubernetes)ProgressDeadlineExc…admission webhook denied the request — Error from server: admission webhook "validate.nginx.ingress.kubernetes.io" denied the request (Kubernetes)admission webhook d…exec format error — exec /usr/local/bin/docker-entrypoint.sh: exec format error (Docker)exec format errorexecutable file not found in $PATH — OCI runtime create failed: exec: "x": executable file not found in $PATH (Docker)executable file not…exec no such file or directory — exec /docker-entrypoint.sh: no such file or directory (CRLF line endings / missing interpreter) (Docker)exec no such file o…daemon — Cannot connect to the Docker daemon at unix:///var/run/docker.sock. Is the docker daemon running? (Docker)daemonExited (0) — Docker container exits immediately (Exited (0) / Exited (1) right after start) (Docker)Exited (0)No such container — Error response from daemon: No such container (Docker)No such containerIndentationError — IndentationError: unexpected indent / expected an indented block (Python)IndentationErrorCOPY failed — COPY failed: file not found in build context / "/app/x": not found (Docker)COPY failednetwork not found — Error response from daemon: network X not found (Docker)network not foundthe attribute version is obsolete — WARN: the attribute `version` is obsolete, it will be ignored (Docker)the attribute versi…iptables: No chain/target/match — driver failed programming external connectivity on endpoint: iptables: No chain/target/match by that name (Docker)iptables: No chain/…NetworkOnMainThreadException — android.os.NetworkOnMainThreadException (Android)NetworkOnMainThread…unknown field — strict decoding error: unknown field "spec.template.spec.containers[0].ports[0].protocl" (Kubernetes)unknown field500.30 — HTTP Error 500.30 - ASP.NET Core app failed to start (.NET)500.30ExceptionInInitializerError — java.lang.ExceptionInInitializerError (Java)ExceptionInInitiali…MySQL won't start — Job for mysql.service failed because the control process exited with error code (MySQL)MySQL won't start502 — HTTP 502 Bad Gateway (HTTP)502503 — HTTP 503 Service Unavailable (HTTP)503IAM AccessDeniedException — AccessDeniedException: User: arn:aws:iam::... is not authorized to perform: service:Action on resource: ... (AWS)IAM AccessDeniedExc…

Directly related (12)

is not runningDocker

Error response from daemon: Container X is not running

You tried to exec into or interact with a container that has stopped.

docker-compose: command not foundDocker

docker-compose: command not found / 'compose' is not a docker command

Your system has only one of the two Compose flavours: the old docker-compose (v1) binary or the newer docker compose (v2) plugin.

Liveness probe failedKubernetes

Liveness probe failed ... Container will be restarted (also Startup probe failed)

The kubelet’s liveness (or startup) check failed enough times that it killed and restarted the container.

ACR unauthorizedAzure

Azure Container Registry: unauthorized: authentication required, visit https://aka.ms/acr/authorization (AKS ErrImagePull 401)

Pulling/pushing to ACR wasn’t authenticated — Docker not logged in, or AKS/App Service lacks AcrPull on the registry.

Readiness probe failedKubernetes

Readiness probe failed: HTTP probe failed with statuscode: 503 / connect: connection refused

The container is running, but its readiness check fails, so the pod is marked not ready and removed from Service endpoints.

Container failed to startGoogle Cloud / Firebase

Cloud Run: The user-provided container failed to start and listen on the port defined provided by the PORT=8080 environment variable

Cloud Run started your container, but nothing listened on $PORT within the startup timeout — the app crashed, listens on another…

Conflict container nameDocker

Conflict. The container name "/x" is already in use by container …

A container (running or stopped) already has that name; Docker won’t create a second one with the same name.

compose validationDocker

docker compose: services.x Additional property y is not allowed / yaml: line N: mapping values are not allowed

The compose file is invalid YAML or uses a key Compose doesn’t recognise at that level (usually an indentation mistake).

Pool overlapsDocker

Error response from daemon: Pool overlaps with other one on this address space

Docker tried to create a network whose subnet clashes with an existing Docker network (or a VPN/host route).

depends on undefined serviceDocker

service "web" depends on undefined service "db": invalid compose project

A service lists depends_on (or links/networks) for a service name that isn’t defined in the Compose file(s) being used.

Restarting (1)Docker

Docker container keeps restarting (Restarting (1) x seconds ago)

The container crashes on start and its restart policy (always/unless-stopped/on-failure) starts it again in a loop.

Health checks failedAWS

ALB target unhealthy: Health checks failed with these codes: [404] / Request timed out

The load balancer’s health checks to your targets fail, so it stops sending traffic (and returns 502/503 if no targets are health…

Two steps away (34)

port is already allocatedDocker

Docker: Bind for 0.0.0.0:80 failed: port is already allocated

Another container or host process already publishes that host port.

CannotPullContainerErrorAWS

ECS task stopped: CannotPullContainerError: pull image manifest has been retried ... / ref pull has been retried

The ECS task couldn’t pull its image — no network route to the registry, missing ECR permissions, or a wrong image tag.

Essential container in task exitedAWS

ECS: Essential container in task exited (task keeps stopping)

The main (essential) container stopped, so ECS stopped the whole task and the service keeps replacing it.

not a git repositoryGit

fatal: not a git repository (or any of the parent directories): .git

You ran a Git command outside a Git working tree.

command not foundLinux

bash: command not found

The shell can’t find an executable with that name in any directory on your PATH.

JAVA_HOME not setJava

ERROR: JAVA_HOME is not set and no 'java' command could be found in your PATH.

Build tools (Gradle, Maven, Android tools) can’t find a JDK.

CrashLoopBackOffKubernetes

Kubernetes: CrashLoopBackOff

The container starts, crashes (or exits), and Kubernetes keeps restarting it with increasing back-off delays.

OOMKilledKubernetes

Kubernetes: OOMKilled (exit code 137)

The container used more memory than its limit, and the kernel killed it.

is waiting to startKubernetes

Error from server (BadRequest): container "x" in pod "y" is waiting to start: ContainerCreating

kubectl logs has nothing to show yet — the container hasn’t started (still creating, pulling, or blocked).

ImagePullBackOffKubernetes

Kubernetes: ImagePullBackOff / ErrImagePull

The node can’t pull the container image — wrong name/tag, missing registry credentials, or registry unreachable.

EROFSnpm

npm ERR! code EROFS — EROFS: read-only file system

npm tried to write to a read-only location (read-only container filesystem, mounted volume, or system path).

ECR token expiredAWS

denied: Your authorization token has expired. Reauthenticate and try again. (Amazon ECR)

Docker’s login to Amazon ECR has expired — ECR tokens last 12 hours, so pushes and pulls fail until you log in again.

no endpointsKubernetes

Service has no endpoints (no endpoints available for service / Endpoints: <none>)

The Service’s selector matches no ready pods, so traffic to it is refused or returns 503.

ProgressDeadlineExceededKubernetes

deployment "x" exceeded its progress deadline (ProgressDeadlineExceeded)

A rollout didn’t make progress within progressDeadlineSeconds (default 600) — new pods never became ready.

admission webhook denied the requestKubernetes

Error from server: admission webhook "validate.nginx.ingress.kubernetes.io" denied the request

A validating admission webhook (ingress-nginx, Gatekeeper/OPA, Kyverno) inspected your object and rejected it; the reason follows…

exec format errorDocker

exec /usr/local/bin/docker-entrypoint.sh: exec format error

The container tried to run a binary built for a different CPU architecture (arm64 vs amd64) — or a script with a broken shebang /…

executable file not found in $PATHDocker

OCI runtime create failed: exec: "x": executable file not found in $PATH

The command you asked the container to run doesn’t exist inside the image — wrong command name, a shell that isn’t installed (bas…

exec no such file or directoryDocker

exec /docker-entrypoint.sh: no such file or directory (CRLF line endings / missing interpreter)

The entrypoint file exists, but the kernel can’t run it — almost always Windows CRLF line endings in the script, or a shebang poi…

daemonDocker

Cannot connect to the Docker daemon at unix:///var/run/docker.sock. Is the docker daemon running?

The docker CLI can’t talk to the Docker engine — it isn’t running, or your user can’t access the socket.

Exited (0)Docker

Docker container exits immediately (Exited (0) / Exited (1) right after start)

The container started and its main process finished at once, so the container stopped — Docker containers only live as long as PI…

No such containerDocker

Error response from daemon: No such container

The container name or ID you used doesn’t exist on this Docker host — it was removed, has another name, or you’re talking to a di…

IndentationErrorPython

IndentationError: unexpected indent / expected an indented block

Python’s block structure is broken — inconsistent indentation or mixed tabs and spaces.

COPY failedDocker

COPY failed: file not found in build context / "/app/x": not found

The Dockerfile COPY refers to a path outside the build context, excluded by .dockerignore, or relative to the wrong directory.

network not foundDocker

Error response from daemon: network X not found

The container or Compose project refers to a Docker network that doesn’t exist (any more).

the attribute version is obsoleteDocker

WARN: the attribute `version` is obsolete, it will be ignored

A harmless Compose v2 warning: the top-level version: line in docker-compose.yml is no longer used.

iptables: No chain/target/matchDocker

driver failed programming external connectivity on endpoint: iptables: No chain/target/match by that name

Docker’s iptables rules were wiped (firewalld/ufw reload, iptables flush) while Docker was running, so it can’t publish ports.

NetworkOnMainThreadExceptionAndroid

android.os.NetworkOnMainThreadException

The app made a network call on the main (UI) thread, which Android forbids.

unknown fieldKubernetes

strict decoding error: unknown field "spec.template.spec.containers[0].ports[0].protocl"

The manifest contains a field the API schema doesn’t know — a typo, wrong indentation, or a field from another API version.

500.30.NET

HTTP Error 500.30 - ASP.NET Core app failed to start

IIS/Azure’s ASP.NET Core Module launched your app but it crashed during startup.

ExceptionInInitializerErrorJava

java.lang.ExceptionInInitializerError

A static initializer (static block or static field) threw an exception while the class was loading.

MySQL won't startMySQL

Job for mysql.service failed because the control process exited with error code

The MySQL/MariaDB service failed to start — the real reason is in the MySQL error log.

502HTTP

HTTP 502 Bad Gateway

A proxy or gateway (Nginx, load balancer, CDN) got an invalid response — or no response — from the upstream server behind it.

503HTTP

HTTP 503 Service Unavailable

The server is temporarily unable to handle the request — overloaded, in maintenance, or has no healthy backends.

IAM AccessDeniedExceptionAWS

AccessDeniedException: User: arn:aws:iam::... is not authorized to perform: service:Action on resource: ...

The IAM user or role making the call has no permission for that action on that resource — the message names both.