Error map

ProgressDeadlineExceeded deployment "x" exceeded its progress deadline (ProgressDeadlineExceeded)

Kubernetes · layer 6, Platform & cloud

Open the full error page →

Centre: this error. First ring: errors it is linked with (12). Outer ring: what those are linked with. Colours show the layer of a request each error belongs to. Click any dot to re-centre the map on it; hover to follow its connections. The centre dot opens the error page.

ProgressDeadlineExceeded — deployment "x" exceeded its progress deadline (ProgressDeadlineExceeded) (Kubernetes)ProgressDea…another operation is in progress — Error: UPGRADE FAILED: another operation (install/upgrade/rollback) is in progress (Kubernetes)another operation i…Environment health has transitioned to Severe — Elastic Beanstalk: Environment health has transitioned from Ok to Severe (AWS)Environment health …InvalidTemplateDeployment — ARM/Bicep: DeploymentFailed / InvalidTemplateDeployment / InvalidTemplate (Azure)InvalidTemplateDepl…Readiness probe failed — Readiness probe failed: HTTP probe failed with statuscode: 503 / connect: connection refused (Kubernetes)Readiness probe fai…CrashLoopBackOff — Kubernetes: CrashLoopBackOff (Kubernetes)CrashLoopBackOffImagePullBackOff — Kubernetes: ImagePullBackOff / ErrImagePull (Kubernetes)ImagePullBackOffNo job functions found — Azure Functions: No job functions found. Try making your job classes and methods public / Error indexing method (Azure)No job functions fo…ROLLBACK_COMPLETE — Stack is in ROLLBACK_COMPLETE state and can not be updated (AWS)ROLLBACK_COMPLETEUPDATE_ROLLBACK_FAILED — CloudFormation stack in UPDATE_ROLLBACK_FAILED (AWS)UPDATE_ROLLBACK_FAI…Multi-Attach error — Multi-Attach error for volume: Volume is already exclusively attached to one node and can't be attached to another (Kubernetes)Multi-Attach errorfield is immutable — The Deployment is invalid: spec.selector: Invalid value: field is immutable (Kubernetes)field is immutable1104 — Cloudflare Error 1104: A variation of this script was not found (Worker route to deleted script) (Cloudflare)1104github-actions[bot] 403 — remote: Permission to owner/repo.git denied to github-actions[bot]. fatal: unable to access … The requested URL returned error: 403 (Git)github-actions[bot]…No updates are to be performed — CloudFormation: No updates are to be performed (AWS)No updates are to b…toomanyrequests — toomanyrequests: You have reached your pull rate limit (Docker Hub) (Docker)toomanyrequests502 — HTTP 502 Bad Gateway (HTTP)502503 — HTTP 503 Service Unavailable (HTTP)503MessageRejected — SES MessageRejected: Email address is not verified. The following identities failed the check in region (AWS)MessageRejectedSkuNotAvailable — Azure: SkuNotAvailable / QuotaExceeded when creating a VM or resource (Azure)SkuNotAvailableResourceGroupNotFound — ResourceGroupNotFound: Resource group 'x' could not be found (Azure)ResourceGroupNotFou…ResourceNotFound — ResourceNotFound: The Resource 'Microsoft.X/...' under resource group 'y' was not found (Azure)ResourceNotFoundHealth checks failed — ALB target unhealthy: Health checks failed with these codes: [404] / Request timed out (AWS)Health checks failedunhealthy — Docker container is unhealthy (health check failing) (Docker)unhealthyLiveness probe failed — Liveness probe failed ... Container will be restarted (also Startup probe failed) (Kubernetes)Liveness probe fail…ENOSPC — no space left on device (Docker / Linux) (Docker)ENOSPCOOMKilled — Kubernetes: OOMKilled (exit code 137) (Kubernetes)OOMKilledApp Service Application Error — Azure App Service: ":( Application Error" / container didn’t respond to HTTP pings (Azure)App Service Applica…exec format error — exec /usr/local/bin/docker-entrypoint.sh: exec format error (Docker)exec format errorFailedScheduling — Kubernetes: Pod stuck in Pending — FailedScheduling: 0/3 nodes are available (Kubernetes)FailedSchedulingGD missing — Fatal error: Uncaught Error: Call to undefined function imagecreatefromjpeg() (PHP)GD missingAzureWebJobsStorage — Azure Functions: Value cannot be null. (Parameter 'connectionString') / Missing value for AzureWebJobsStorage (Azure)AzureWebJobsStorageOutput directory not found — Cloudflare Pages build: Error: Output directory "dist" not found / Failed: build output directory not found (Cloudflare)Output directory no…already exists in stack — CloudFormation: Resource ... already exists (AlreadyExists / already exists in stack) (AWS)already exists in s…AuthorizationPermissionMismatch — Azure Storage: AuthorizationPermissionMismatch (403) — This request is not authorized to perform this operation using this permission (Azure)AuthorizationPermis…QuotaExceededError — QuotaExceededError: Failed to execute 'setItem' on 'Storage': Setting the value exceeded the quota (JavaScript)QuotaExceededError126 incorrect key file — MySQL ERROR 126 (HY000): Incorrect key file for table; try to repair it (MySQL)126 incorrect key f…AlreadyExists — Error from server (AlreadyExists): ... already exists (Kubernetes)AlreadyExistsunknown field — strict decoding error: unknown field "spec.template.spec.containers[0].ports[0].protocl" (Kubernetes)unknown fieldthe object has been modified — Operation cannot be fulfilled on deployments.apps "x": the object has been modified; please apply your changes to the latest version and try again (Kubernetes)the object has been…1019 — Cloudflare Error 1019: Compute server error (Workers) (Cloudflare)10191025 — Cloudflare Error 1025: Please check back later (Workers request limit) (Cloudflare)10251101 — Cloudflare Error 1101: Worker threw exception (Cloudflare)1101

Directly related (12)

another operation is in progressKubernetes

Error: UPGRADE FAILED: another operation (install/upgrade/rollback) is in progress

A previous Helm operation on this release was interrupted and left it in a pending-install/pending-upgrade state, so Helm refuses…

Environment health has transitioned to SevereAWS

Elastic Beanstalk: Environment health has transitioned from Ok to Severe

Most instances in the Elastic Beanstalk environment are failing health checks or returning errors.

InvalidTemplateDeploymentAzure

ARM/Bicep: DeploymentFailed / InvalidTemplateDeployment / InvalidTemplate

An Azure Resource Manager (ARM/Bicep/Terraform) deployment failed; the inner error under “details” has the real cause.

Readiness probe failedKubernetes

Readiness probe failed: HTTP probe failed with statuscode: 503 / connect: connection refused

The container is running, but its readiness check fails, so the pod is marked not ready and removed from Service endpoints.

CrashLoopBackOffKubernetes

Kubernetes: CrashLoopBackOff

The container starts, crashes (or exits), and Kubernetes keeps restarting it with increasing back-off delays.

ImagePullBackOffKubernetes

Kubernetes: ImagePullBackOff / ErrImagePull

The node can’t pull the container image — wrong name/tag, missing registry credentials, or registry unreachable.

No job functions foundAzure

Azure Functions: No job functions found. Try making your job classes and methods public / Error indexing method

The Functions host started but couldn’t discover or index any functions — wrong project structure, extension/binding problems or…

ROLLBACK_COMPLETEAWS

Stack is in ROLLBACK_COMPLETE state and can not be updated

The stack’s first creation failed and rolled back; a stack in ROLLBACK_COMPLETE can only be deleted, not updated.

UPDATE_ROLLBACK_FAILEDAWS

CloudFormation stack in UPDATE_ROLLBACK_FAILED

An update failed, and then the rollback also failed, leaving the stack stuck until you continue the rollback.

Multi-Attach errorKubernetes

Multi-Attach error for volume: Volume is already exclusively attached to one node and can't be attached to another

A ReadWriteOnce volume (EBS, Azure Disk, PD) is still attached to another node, so the new pod on a different node can’t use it.

field is immutableKubernetes

The Deployment is invalid: spec.selector: Invalid value: field is immutable

You tried to change a field Kubernetes doesn’t allow to change after creation — Deployment selectors, Job templates, Service clus…

1104Cloudflare

Cloudflare Error 1104: A variation of this script was not found (Worker route to deleted script)

A Worker route points to a script that no longer exists (deleted, renamed or not deployed to that environment).

Two steps away (30)

github-actions[bot] 403Git

remote: Permission to owner/repo.git denied to github-actions[bot]. fatal: unable to access … The requested URL returned error: 403

A GitHub Actions workflow tried to push but the GITHUB_TOKEN doesn’t have write permission.

No updates are to be performedAWS

CloudFormation: No updates are to be performed

You ran an update/deploy with a template and parameters identical to what’s deployed, so there’s nothing to change.

toomanyrequestsDocker

toomanyrequests: You have reached your pull rate limit (Docker Hub)

Docker Hub limits anonymous and free pulls; your IP or account has used its quota for the current window.

502HTTP

HTTP 502 Bad Gateway

A proxy or gateway (Nginx, load balancer, CDN) got an invalid response — or no response — from the upstream server behind it.

503HTTP

HTTP 503 Service Unavailable

The server is temporarily unable to handle the request — overloaded, in maintenance, or has no healthy backends.

MessageRejectedAWS

SES MessageRejected: Email address is not verified. The following identities failed the check in region

SES refused to send because the From address/domain isn’t verified — or the account is still in the SES sandbox, where recipients…

SkuNotAvailableAzure

Azure: SkuNotAvailable / QuotaExceeded when creating a VM or resource

The VM size isn’t offered in that region/zone for your subscription, or you’ve hit the vCPU quota.

ResourceGroupNotFoundAzure

ResourceGroupNotFound: Resource group 'x' could not be found

The resource group doesn’t exist in the subscription the command or deployment is using.

ResourceNotFoundAzure

ResourceNotFound: The Resource 'Microsoft.X/...' under resource group 'y' was not found

The specific resource doesn’t exist in that resource group/subscription — wrong name, group or subscription, or it was deleted.

Health checks failedAWS

ALB target unhealthy: Health checks failed with these codes: [404] / Request timed out

The load balancer’s health checks to your targets fail, so it stops sending traffic (and returns 502/503 if no targets are health…

unhealthyDocker

Docker container is unhealthy (health check failing)

The container is running, but its HEALTHCHECK command keeps failing, so Docker (and dependent services) consider it unhealthy.

Liveness probe failedKubernetes

Liveness probe failed ... Container will be restarted (also Startup probe failed)

The kubelet’s liveness (or startup) check failed enough times that it killed and restarted the container.

ENOSPCDocker

no space left on device (Docker / Linux)

The disk (or inode table) is full — Docker images, build cache, logs and volumes are common culprits.

OOMKilledKubernetes

Kubernetes: OOMKilled (exit code 137)

The container used more memory than its limit, and the kernel killed it.

App Service Application ErrorAzure

Azure App Service: ":( Application Error" / container didn’t respond to HTTP pings

App Service started your app but it crashed or never listened on the expected port.

exec format errorDocker

exec /usr/local/bin/docker-entrypoint.sh: exec format error

The container tried to run a binary built for a different CPU architecture (arm64 vs amd64) — or a script with a broken shebang /…

FailedSchedulingKubernetes

Kubernetes: Pod stuck in Pending — FailedScheduling: 0/3 nodes are available

The scheduler can’t find a node that satisfies the pod’s resource requests, selectors, taints or volume constraints.

GD missingPHP

Fatal error: Uncaught Error: Call to undefined function imagecreatefromjpeg()

The GD extension (or its JPEG/WebP support) isn’t installed for the PHP version serving the site.

AzureWebJobsStorageAzure

Azure Functions: Value cannot be null. (Parameter 'connectionString') / Missing value for AzureWebJobsStorage

A Functions app setting or binding connection string is missing — most often AzureWebJobsStorage locally (local.settings.json) or…

Output directory not foundCloudflare

Cloudflare Pages build: Error: Output directory "dist" not found / Failed: build output directory not found

The Pages build finished, but the folder set as “Build output directory” doesn’t exist — the framework wrote its files somewhere…

already exists in stackAWS

CloudFormation: Resource ... already exists (AlreadyExists / already exists in stack)

The template tries to create a resource with a fixed name that already exists — created manually, by another stack, or left over…

AuthorizationPermissionMismatchAzure

Azure Storage: AuthorizationPermissionMismatch (403) — This request is not authorized to perform this operation using this permission

You’re accessing blob/queue data with Microsoft Entra ID, but the identity has only management roles (Owner/Contributor) — not a…

QuotaExceededErrorJavaScript

QuotaExceededError: Failed to execute 'setItem' on 'Storage': Setting the value exceeded the quota

localStorage/sessionStorage is full (about 5 MB per origin) or storage is disabled.

126 incorrect key fileMySQL

MySQL ERROR 126 (HY000): Incorrect key file for table; try to repair it

MySQL can’t use a table’s index file — usually a full tmp disk during a query, or MyISAM corruption.

AlreadyExistsKubernetes

Error from server (AlreadyExists): ... already exists

kubectl create tried to make an object whose name is already taken in that namespace.

unknown fieldKubernetes

strict decoding error: unknown field "spec.template.spec.containers[0].ports[0].protocl"

The manifest contains a field the API schema doesn’t know — a typo, wrong indentation, or a field from another API version.

the object has been modifiedKubernetes

Operation cannot be fulfilled on deployments.apps "x": the object has been modified; please apply your changes to the latest version and try again

Optimistic-concurrency conflict: the object changed (new resourceVersion) between when you read it and when you tried to update i…

1019Cloudflare

Cloudflare Error 1019: Compute server error (Workers)

A Cloudflare Worker routed the request to a loop or hit an internal compute error.

1025Cloudflare

Cloudflare Error 1025: Please check back later (Workers request limit)

The site’s Cloudflare Workers plan exceeded its daily request limit (free plan: 100,000 requests/day).

1101Cloudflare

Cloudflare Error 1101: Worker threw exception

The Cloudflare Worker serving this route threw an uncaught JavaScript exception.