Error map

1104 Cloudflare Error 1104: A variation of this script was not found (Worker route to deleted script)

Cloudflare · layer 3, Edge & web server

Open the full error page →

Centre: this error. First ring: errors it is linked with (12). Outer ring: what those are linked with. Colours show the layer of a request each error belongs to. Click any dot to re-centre the map on it; hover to follow its connections. The centre dot opens the error page.

1104 — Cloudflare Error 1104: A variation of this script was not found (Worker route to deleted script) (Cloudflare)11041019 — Cloudflare Error 1019: Compute server error (Workers) (Cloudflare)10191025 — Cloudflare Error 1025: Please check back later (Workers request limit) (Cloudflare)10251101 — Cloudflare Error 1101: Worker threw exception (Cloudflare)1101Environment health has transitioned to Severe — Elastic Beanstalk: Environment health has transitioned from Ok to Severe (AWS)Environment health …ProgressDeadlineExceeded — deployment "x" exceeded its progress deadline (ProgressDeadlineExceeded) (Kubernetes)ProgressDeadlineExc…1102 — Cloudflare Error 1102: Worker exceeded resource limits (CPU time / memory) (Cloudflare)110210000 — wrangler / Cloudflare API: Authentication error [code: 10000] (Cloudflare)10000Output directory not found — Cloudflare Pages build: Error: Output directory "dist" not found / Failed: build output directory not found (Cloudflare)Output directory no…No job functions found — Azure Functions: No job functions found. Try making your job classes and methods public / Error indexing method (Azure)No job functions fo…ROLLBACK_COMPLETE — Stack is in ROLLBACK_COMPLETE state and can not be updated (AWS)ROLLBACK_COMPLETEUPDATE_ROLLBACK_FAILED — CloudFormation stack in UPDATE_ROLLBACK_FAILED (AWS)UPDATE_ROLLBACK_FAI…field is immutable — The Deployment is invalid: spec.selector: Invalid value: field is immutable (Kubernetes)field is immutable404 — HTTP 404 Not Found (HTTP)404405 — HTTP 405 Method Not Allowed (HTTP)405Whitelabel Error Page — Whitelabel Error Page — This application has no explicit mapping for /error (Java)Whitelabel Error Pa…EMFILE — Too many open files (EMFILE) (Linux)EMFILERequestEntityTooLargeException — Lambda: Request must be smaller than 6291456 bytes for the InvokeFunction operation (RequestEntityTooLargeException) (AWS)RequestEntityTooLar…Unzipped size must be smaller than 262144000 bytes — Lambda: Unzipped size must be smaller than 262144000 bytes (AWS)Unzipped size must …TypeError — TypeError: Cannot read properties of undefined (reading 'x') (JavaScript)TypeError1000 — Cloudflare Error 1000: DNS points to prohibited IP (Cloudflare)1000The editor has encountered an unexpected error — WordPress block editor: The editor has encountered an unexpected error (Attempt Recovery / Copy Error) (WordPress)The editor has enco…502 — HTTP 502 Bad Gateway (HTTP)502503 — HTTP 503 Service Unavailable (HTTP)503MessageRejected — SES MessageRejected: Email address is not verified. The following identities failed the check in region (AWS)MessageRejectedCrashLoopBackOff — Kubernetes: CrashLoopBackOff (Kubernetes)CrashLoopBackOffImagePullBackOff — Kubernetes: ImagePullBackOff / ErrImagePull (Kubernetes)ImagePullBackOffMulti-Attach error — Multi-Attach error for volume: Volume is already exclusively attached to one node and can't be attached to another (Kubernetes)Multi-Attach errorfork: retry: Resource temporarily unavailable — fork: retry: Resource temporarily unavailable (process/thread limit) (Linux)fork: retry: Resour…413 (Cloudflare 100 MB) — Cloudflare 413 Request Entity Too Large (upload over the plan limit) (Cloudflare)413 (Cloudflare 100…query is too complex — GraphQL: Query is too complex / exceeds maximum operation depth / complexity limit (API)query is too complex401 — HTTP 401 Unauthorized (HTTP)401403 — HTTP 403 Forbidden (HTTP)403No hosted parallelism — Azure Pipelines: No hosted parallelism has been purchased or granted (Azure)No hosted paralleli…ELIFECYCLE — npm ERR! code ELIFECYCLE / Command failed with exit code 1 (npm)ELIFECYCLEgyp ERR! — gyp ERR! build error / node-gyp rebuild failed (npm)gyp ERR!COPY failed — COPY failed: file not found in build context / "/app/x": not found (Docker)COPY failedApp Service Application Error — Azure App Service: ":( Application Error" / container didn’t respond to HTTP pings (Azure)App Service Applica…InvalidTemplateDeployment — ARM/Bicep: DeploymentFailed / InvalidTemplateDeployment / InvalidTemplate (Azure)InvalidTemplateDepl…AzureWebJobsStorage — Azure Functions: Value cannot be null. (Parameter 'connectionString') / Missing value for AzureWebJobsStorage (Azure)AzureWebJobsStorageNo updates are to be performed — CloudFormation: No updates are to be performed (AWS)No updates are to b…already exists in stack — CloudFormation: Resource ... already exists (AlreadyExists / already exists in stack) (AWS)already exists in s…AlreadyExists — Error from server (AlreadyExists): ... already exists (Kubernetes)AlreadyExistsunknown field — strict decoding error: unknown field "spec.template.spec.containers[0].ports[0].protocl" (Kubernetes)unknown fieldthe object has been modified — Operation cannot be fulfilled on deployments.apps "x": the object has been modified; please apply your changes to the latest version and try again (Kubernetes)the object has been…

Directly related (12)

1019Cloudflare

Cloudflare Error 1019: Compute server error (Workers)

A Cloudflare Worker routed the request to a loop or hit an internal compute error.

1025Cloudflare

Cloudflare Error 1025: Please check back later (Workers request limit)

The site’s Cloudflare Workers plan exceeded its daily request limit (free plan: 100,000 requests/day).

1101Cloudflare

Cloudflare Error 1101: Worker threw exception

The Cloudflare Worker serving this route threw an uncaught JavaScript exception.

Environment health has transitioned to SevereAWS

Elastic Beanstalk: Environment health has transitioned from Ok to Severe

Most instances in the Elastic Beanstalk environment are failing health checks or returning errors.

ProgressDeadlineExceededKubernetes

deployment "x" exceeded its progress deadline (ProgressDeadlineExceeded)

A rollout didn’t make progress within progressDeadlineSeconds (default 600) — new pods never became ready.

1102Cloudflare

Cloudflare Error 1102: Worker exceeded resource limits (CPU time / memory)

The Worker used more CPU time or memory than its plan allows for a single request.

10000Cloudflare

wrangler / Cloudflare API: Authentication error [code: 10000]

The Cloudflare API rejected the token — it’s invalid, expired, missing permissions, or scoped to another account/zone.

Output directory not foundCloudflare

Cloudflare Pages build: Error: Output directory "dist" not found / Failed: build output directory not found

The Pages build finished, but the folder set as “Build output directory” doesn’t exist — the framework wrote its files somewhere…

No job functions foundAzure

Azure Functions: No job functions found. Try making your job classes and methods public / Error indexing method

The Functions host started but couldn’t discover or index any functions — wrong project structure, extension/binding problems or…

ROLLBACK_COMPLETEAWS

Stack is in ROLLBACK_COMPLETE state and can not be updated

The stack’s first creation failed and rolled back; a stack in ROLLBACK_COMPLETE can only be deleted, not updated.

UPDATE_ROLLBACK_FAILEDAWS

CloudFormation stack in UPDATE_ROLLBACK_FAILED

An update failed, and then the rollback also failed, leaving the stack stuck until you continue the rollback.

field is immutableKubernetes

The Deployment is invalid: spec.selector: Invalid value: field is immutable

You tried to change a field Kubernetes doesn’t allow to change after creation — Deployment selectors, Job templates, Service clus…

Two steps away (32)

404HTTP

HTTP 404 Not Found

The server can’t find anything at the requested URL.

405HTTP

HTTP 405 Method Not Allowed

The URL exists, but it doesn’t accept the HTTP method you used (e.g. POST to a GET-only route).

Whitelabel Error PageJava

Whitelabel Error Page — This application has no explicit mapping for /error

Spring Boot’s default error page — the request hit no controller mapping (404) or a controller threw (500).

EMFILELinux

Too many open files (EMFILE)

The process hit its file-descriptor limit — sockets, files and pipes all count.

RequestEntityTooLargeExceptionAWS

Lambda: Request must be smaller than 6291456 bytes for the InvokeFunction operation (RequestEntityTooLargeException)

The event payload (or response) is over Lambda’s 6 MB synchronous limit (256 KB for async invocations).

Unzipped size must be smaller than 262144000 bytesAWS

Lambda: Unzipped size must be smaller than 262144000 bytes

The function code plus layers exceed Lambda’s 250 MB unzipped limit for zip deployments.

TypeErrorJavaScript

TypeError: Cannot read properties of undefined (reading 'x')

You tried to access a property on a value that is `undefined` (or `null`) — usually data that hasn’t loaded yet or a wrong proper…

1000Cloudflare

Cloudflare Error 1000: DNS points to prohibited IP

A proxied DNS record points at a Cloudflare IP address, creating a loop.

The editor has encountered an unexpected errorWordPress

WordPress block editor: The editor has encountered an unexpected error (Attempt Recovery / Copy Error)

A JavaScript error broke the block editor — usually a plugin/theme block script conflict, cached old scripts, or a browser extens…

502HTTP

HTTP 502 Bad Gateway

A proxy or gateway (Nginx, load balancer, CDN) got an invalid response — or no response — from the upstream server behind it.

503HTTP

HTTP 503 Service Unavailable

The server is temporarily unable to handle the request — overloaded, in maintenance, or has no healthy backends.

MessageRejectedAWS

SES MessageRejected: Email address is not verified. The following identities failed the check in region

SES refused to send because the From address/domain isn’t verified — or the account is still in the SES sandbox, where recipients…

CrashLoopBackOffKubernetes

Kubernetes: CrashLoopBackOff

The container starts, crashes (or exits), and Kubernetes keeps restarting it with increasing back-off delays.

ImagePullBackOffKubernetes

Kubernetes: ImagePullBackOff / ErrImagePull

The node can’t pull the container image — wrong name/tag, missing registry credentials, or registry unreachable.

Multi-Attach errorKubernetes

Multi-Attach error for volume: Volume is already exclusively attached to one node and can't be attached to another

A ReadWriteOnce volume (EBS, Azure Disk, PD) is still attached to another node, so the new pod on a different node can’t use it.

fork: retry: Resource temporarily unavailableLinux

fork: retry: Resource temporarily unavailable (process/thread limit)

The user or container hit its maximum number of processes/threads (ulimit -u, pids cgroup), so new processes can’t be created.

413 (Cloudflare 100 MB)Cloudflare

Cloudflare 413 Request Entity Too Large (upload over the plan limit)

The request body is larger than Cloudflare allows through the proxy — 100 MB on Free/Pro, 200 MB Business, 500 MB Enterprise defa…

query is too complexAPI

GraphQL: Query is too complex / exceeds maximum operation depth / complexity limit

The server rejected the query because it’s too deep or too expensive according to its depth/complexity limits.

401HTTP

HTTP 401 Unauthorized

The request has no valid authentication credentials — you need to log in or send a valid token.

403HTTP

HTTP 403 Forbidden

The server understood the request but refuses to authorize it — you (or the server process) are not allowed to access this resour…

No hosted parallelismAzure

Azure Pipelines: No hosted parallelism has been purchased or granted

The Azure DevOps organization has no Microsoft-hosted parallel jobs, so pipelines can’t run on hosted agents.

ELIFECYCLEnpm

npm ERR! code ELIFECYCLE / Command failed with exit code 1

An npm script (build, start, test, postinstall) exited with an error. ELIFECYCLE is only the wrapper — the real error is printed…

gyp ERR!npm

gyp ERR! build error / node-gyp rebuild failed

A dependency with native C/C++ code couldn’t compile — missing build tools, Python, or an unsupported Node version.

COPY failedDocker

COPY failed: file not found in build context / "/app/x": not found

The Dockerfile COPY refers to a path outside the build context, excluded by .dockerignore, or relative to the wrong directory.

App Service Application ErrorAzure

Azure App Service: ":( Application Error" / container didn’t respond to HTTP pings

App Service started your app but it crashed or never listened on the expected port.

InvalidTemplateDeploymentAzure

ARM/Bicep: DeploymentFailed / InvalidTemplateDeployment / InvalidTemplate

An Azure Resource Manager (ARM/Bicep/Terraform) deployment failed; the inner error under “details” has the real cause.

AzureWebJobsStorageAzure

Azure Functions: Value cannot be null. (Parameter 'connectionString') / Missing value for AzureWebJobsStorage

A Functions app setting or binding connection string is missing — most often AzureWebJobsStorage locally (local.settings.json) or…

No updates are to be performedAWS

CloudFormation: No updates are to be performed

You ran an update/deploy with a template and parameters identical to what’s deployed, so there’s nothing to change.

already exists in stackAWS

CloudFormation: Resource ... already exists (AlreadyExists / already exists in stack)

The template tries to create a resource with a fixed name that already exists — created manually, by another stack, or left over…

AlreadyExistsKubernetes

Error from server (AlreadyExists): ... already exists

kubectl create tried to make an object whose name is already taken in that namespace.

unknown fieldKubernetes

strict decoding error: unknown field "spec.template.spec.containers[0].ports[0].protocl"

The manifest contains a field the API schema doesn’t know — a typo, wrong indentation, or a field from another API version.

the object has been modifiedKubernetes

Operation cannot be fulfilled on deployments.apps "x": the object has been modified; please apply your changes to the latest version and try again

Optimistic-concurrency conflict: the object changed (new resourceVersion) between when you read it and when you tried to update i…