Error map
10000 wrangler / Cloudflare API: Authentication error [code: 10000]
Cloudflare · layer 3, Edge & web server
Centre: this error. First ring: errors it is linked with (12). Outer ring: what those are linked with. Colours show the layer of a request each error belongs to. Click any dot to re-centre the map on it; hover to follow its connections. The centre dot opens the error page.
Directly related (12)
HTTP 403 Forbidden
The server understood the request but refuses to authorize it — you (or the server process) are not allowed to access this resour…
HTTP 401 Unauthorized
The request has no valid authentication credentials — you need to log in or send a valid token.
Cloudflare Error 1019: Compute server error (Workers)
A Cloudflare Worker routed the request to a loop or hit an internal compute error.
Cloudflare Error 1025: Please check back later (Workers request limit)
The site’s Cloudflare Workers plan exceeded its daily request limit (free plan: 100,000 requests/day).
Cloudflare Error 1101: Worker threw exception
The Cloudflare Worker serving this route threw an uncaught JavaScript exception.
Cloudflare Error 1102: Worker exceeded resource limits (CPU time / memory)
The Worker used more CPU time or memory than its plan allows for a single request.
Failed to find target with hash string 'android-34' / Failed to install the following Android SDK packages as some licences have not been accepted
Gradle needs an SDK platform/build-tools that isn’t installed, or the licences haven’t been accepted on this machine.
Azure Pipelines: No hosted parallelism has been purchased or granted
The Azure DevOps organization has no Microsoft-hosted parallel jobs, so pipelines can’t run on hosted agents.
Azure Pipelines: There was a resource authorization issue: The pipeline is not valid. Could not find a service connection with identifier x
The pipeline references a service connection that doesn’t exist in the project or isn’t authorized for this pipeline.
Cloudflare Error 1104: A variation of this script was not found (Worker route to deleted script)
A Worker route points to a script that no longer exists (deleted, renamed or not deployed to that environment).
Gradle: Expiring Daemon because JVM heap space is exhausted / java.lang.OutOfMemoryError: Java heap space during build
The Gradle daemon (or Kotlin daemon) ran out of memory compiling or dexing the project.
Command CodeSign failed with a nonzero exit code (errSecInternalComponent / resource fork, Finder information not allowed)
codesign failed — the keychain is locked (CI/SSH), the private key is inaccessible, or files carry extended attributes that can’t…
Two steps away (36)
Git: Permission denied (publickey). fatal: Could not read from remote repository.
SSH authentication to GitHub/GitLab/Bitbucket failed — no key, wrong key, or the key isn’t added to your account.
AWS S3: AccessDenied (403) when calling GetObject / PutObject
An IAM policy, bucket policy, ACL/ownership setting, Block Public Access or KMS key policy denied the S3 request.
Linux: Permission denied
Your user (or the service user) lacks read/write/execute permission on a file, directory or one of its parents.
Kubernetes: ImagePullBackOff / ErrImagePull
The node can’t pull the container image — wrong name/tag, missing registry credentials, or registry unreachable.
Azure AD (Entra ID): AADSTS700016 Application not found in the directory
The client ID in your sign-in request doesn’t exist in the tenant you’re authenticating against.
HTTP 400 Bad Request
The server could not understand the request because its syntax, headers or body are malformed or invalid.
HTTP 404 Not Found
The server can’t find anything at the requested URL.
HTTP 405 Method Not Allowed
The URL exists, but it doesn’t accept the HTTP method you used (e.g. POST to a GET-only route).
Whitelabel Error Page — This application has no explicit mapping for /error
Spring Boot’s default error page — the request hit no controller mapping (404) or a controller threw (500).
Too many open files (EMFILE)
The process hit its file-descriptor limit — sockets, files and pipes all count.
Lambda: Request must be smaller than 6291456 bytes for the InvokeFunction operation (RequestEntityTooLargeException)
The event payload (or response) is over Lambda’s 6 MB synchronous limit (256 KB for async invocations).
Lambda: Unzipped size must be smaller than 262144000 bytes
The function code plus layers exceed Lambda’s 250 MB unzipped limit for zip deployments.
TypeError: Cannot read properties of undefined (reading 'x')
You tried to access a property on a value that is `undefined` (or `null`) — usually data that hasn’t loaded yet or a wrong proper…
Cloudflare Error 1000: DNS points to prohibited IP
A proxied DNS record points at a Cloudflare IP address, creating a loop.
WordPress block editor: The editor has encountered an unexpected error (Attempt Recovery / Copy Error)
A JavaScript error broke the block editor — usually a plugin/theme block script conflict, cached old scripts, or a browser extens…
fork: retry: Resource temporarily unavailable (process/thread limit)
The user or container hit its maximum number of processes/threads (ulimit -u, pids cgroup), so new processes can’t be created.
Cloudflare 413 Request Entity Too Large (upload over the plan limit)
The request body is larger than Cloudflare allows through the proxy — 100 MB on Free/Pro, 200 MB Business, 500 MB Enterprise defa…
GraphQL: Query is too complex / exceeds maximum operation depth / complexity limit
The server rejected the query because it’s too deep or too expensive according to its depth/complexity limits.
Gradle: Could not resolve all files for configuration / Could not resolve dependency
Gradle couldn’t download a dependency — wrong coordinates/version, missing repository, offline mode, or network/proxy issues.
! [remote rejected] main -> main (shallow update not allowed)
You pushed from a shallow clone to a remote that doesn’t accept shallow history.
remote: Permission to owner/repo.git denied to github-actions[bot]. fatal: unable to access … The requested URL returned error: 403
A GitHub Actions workflow tried to push but the GITHUB_TOKEN doesn’t have write permission.
npm ERR! `npm ci` can only install packages when your package.json and package-lock.json are in sync
package-lock.json doesn’t match package.json, so npm ci refuses to install.
npm ERR! The `npm ci` command can only install with an existing package-lock.json or npm-shrinkwrap.json
npm ci needs a committed lockfile and didn’t find one.
ERR_PNPM_OUTDATED_LOCKFILE Cannot install with "frozen-lockfile" because pnpm-lock.yaml is not up to date with package.json
pnpm’s lockfile doesn’t match package.json, and CI installs with a frozen lockfile.
YN0028: The lockfile would have been modified by this install, which is explicitly forbidden.
Yarn Berry’s immutable install in CI found the lockfile needs changes.
CloudFormation: No updates are to be performed
You ran an update/deploy with a template and parameters identical to what’s deployed, so there’s nothing to change.
toomanyrequests: You have reached your pull rate limit (Docker Hub)
Docker Hub limits anonymous and free pulls; your IP or account has used its quota for the current window.
Stack is in ROLLBACK_COMPLETE state and can not be updated
The stack’s first creation failed and rolled back; a stack in ROLLBACK_COMPLETE can only be deleted, not updated.
CloudFormation stack in UPDATE_ROLLBACK_FAILED
An update failed, and then the rollback also failed, leaving the stack stuck until you continue the rollback.
Elastic Beanstalk: Environment health has transitioned from Ok to Severe
Most instances in the Elastic Beanstalk environment are failing health checks or returning errors.
Kubernetes: OOMKilled (exit code 137)
The container used more memory than its limit, and the kernel killed it.
java.lang.OutOfMemoryError: Java heap space
The JVM ran out of heap memory and garbage collection couldn’t free enough.
Blue Screen: MEMORY_MANAGEMENT (Stop code 0x0000001A)
Windows detected a severe memory-management error — commonly faulty RAM, unstable memory settings or a bad driver.
Xcode: No signing certificate "iOS Development" found
Xcode can’t find a valid code-signing certificate + private key for the selected team in your keychain.
the input device is not a TTY
docker run/exec was called with -t (allocate a terminal) in a context with no terminal — CI, cron, a pipe or a script.
Error: UPGRADE FAILED: another operation (install/upgrade/rollback) is in progress
A previous Helm operation on this release was interrupted and left it in a pending-install/pending-upgrade state, so Helm refuses…
Map another error
Popular: 4035004000xC000007BTypeErrorCritical error404NullPointerException