Error map

YN0028 YN0028: The lockfile would have been modified by this install, which is explicitly forbidden.

npm · layer 7, Build & delivery

Open the full error page →

Centre: this error. First ring: errors it is linked with (12). Outer ring: what those are linked with. Colours show the layer of a request each error belongs to. Click any dot to re-centre the map on it; hover to follow its connections. The centre dot opens the error page.

YN0028 — YN0028: The lockfile would have been modified by this install, which is explicitly forbidden. (npm)YN0028npm ci out of sync — npm ERR! `npm ci` can only install packages when your package.json and package-lock.json are in sync (npm)npm ci out of syncold lockfile — npm WARN old lockfile — The package-lock.json file was created with an old version of npm, so supplemental metadata must be fetched (npm)old lockfileNo updates are to be performed — CloudFormation: No updates are to be performed (AWS)No updates are to b…the input device is not a TTY — the input device is not a TTY (Docker)the input device is…Failed to find target with hash string — Failed to find target with hash string 'android-34' / Failed to install the following Android SDK packages as some licences have not been accepted (Android)Failed to find targ…npm ci no lockfile — npm ERR! The `npm ci` command can only install with an existing package-lock.json or npm-shrinkwrap.json (npm)npm ci no lockfileAADSTS70021 — AADSTS70021: No matching federated identity record found for presented assertion (GitHub Actions / workload identity) (Azure)AADSTS70021EINTEGRITY — npm ERR! code EINTEGRITY — sha512 integrity checksum failed (npm)EINTEGRITYrollup native module — Error: Cannot find module @rollup/rollup-linux-x64-gnu. npm has a bug related to optional dependencies (npm)rollup native moduleERR_PNPM_OUTDATED_LOCKFILE — ERR_PNPM_OUTDATED_LOCKFILE Cannot install with "frozen-lockfile" because pnpm-lock.yaml is not up to date with package.json (npm)ERR_PNPM_OUTDATED_L…toomanyrequests — toomanyrequests: You have reached your pull rate limit (Docker Hub) (Docker)toomanyrequestsNo hosted parallelism — Azure Pipelines: No hosted parallelism has been purchased or granted (Azure)No hosted paralleli…github-actions[bot] 403 — remote: Permission to owner/repo.git denied to github-actions[bot]. fatal: unable to access … The requested URL returned error: 403 (Git)github-actions[bot]…Invalid Version — npm ERR! Invalid Version: (semver parse error) (npm)Invalid VersionELSPROBLEMS — npm ERR! code ELSPROBLEMS — invalid / extraneous / missing packages in npm ls (npm)ELSPROBLEMScaching_sha2_password — Authentication plugin 'caching_sha2_password' cannot be loaded (MySQL)caching_sha2_passwo…cb() never called — npm ERR! cb() never called! (npm)cb() never calledCorepack keyid — Error: Cannot find matching keyid (Corepack signature verification) (npm)Corepack keyidshallow update not allowed — ! [remote rejected] main -> main (shallow update not allowed) (Git)shallow update not …ROLLBACK_COMPLETE — Stack is in ROLLBACK_COMPLETE state and can not be updated (AWS)ROLLBACK_COMPLETEUPDATE_ROLLBACK_FAILED — CloudFormation stack in UPDATE_ROLLBACK_FAILED (AWS)UPDATE_ROLLBACK_FAI…invalid reference format — docker: invalid reference format (repository name must be lowercase) (Docker)invalid reference f…No such container — Error response from daemon: No such container (Docker)No such containeris not running — Error response from daemon: Container X is not running (Docker)is not runningCould not resolve — Gradle: Could not resolve all files for configuration / Could not resolve dependency (Android)Could not resolveanother operation is in progress — Error: UPGRADE FAILED: another operation (install/upgrade/rollback) is in progress (Kubernetes)another operation i…DefaultAzureCredential failed — DefaultAzureCredential failed to retrieve a token from the included credentials / ManagedIdentityCredential authentication unavailable (Azure)DefaultAzureCredent…service connection could not be found — Azure Pipelines: There was a resource authorization issue: The pipeline is not valid. Could not find a service connection with identifier x (Azure)service connection …Gradle Java heap space — Gradle: Expiring Daemon because JVM heap space is exhausted / java.lang.OutOfMemoryError: Java heap space during build (Android)Gradle Java heap sp…Command CodeSign failed — Command CodeSign failed with a nonzero exit code (errSecInternalComponent / resource fork, Finder information not allowed) (iOS)Command CodeSign fa…sts:AssumeRole denied — is not authorized to perform: sts:AssumeRole on resource: arn:aws:iam::...:role/... (AWS)sts:AssumeRole deni…AADSTS50020 — AADSTS50020: User account from identity provider does not exist in tenant and cannot access the application (Azure)AADSTS50020AADSTS50034 — AADSTS50034: The user account does not exist in the directory (Azure)AADSTS50034ERESOLVE — npm ERR! code ERESOLVE — unable to resolve dependency tree (npm)ERESOLVEE404 — npm ERR! code E404 — 404 Not Found: package@version is not in this registry (npm)E404tarball corrupted — npm WARN tar TAR_ENTRY_ERROR / npm ERR! tarball data for x seems to be corrupted (npm)tarball corruptedMODULE_NOT_FOUND — Error: Cannot find module 'x' (MODULE_NOT_FOUND) (Node.js)MODULE_NOT_FOUNDgyp ERR! — gyp ERR! build error / node-gyp rebuild failed (npm)gyp ERR!No Xcode or CLT — gyp: No Xcode or CLT version detected! (npm)No Xcode or CLTImagePullBackOff — Kubernetes: ImagePullBackOff / ErrImagePull (Kubernetes)ImagePullBackOff429 — HTTP 429 Too Many Requests (HTTP)429ProvisionedThroughputExceededException — ProvisionedThroughputExceededException: The level of configured provisioned throughput for the table was exceeded (AWS)ProvisionedThroughp…TF401019 — TF401019: The Git repository with name or identifier x does not exist or you do not have permissions for the operation (Azure)TF40101910000 — wrangler / Cloudflare API: Authentication error [code: 10000] (Cloudflare)10000This job is stuck because you don't have any active runners — GitLab CI: This job is stuck because you don't have any active runners online or available with any of these tags assigned to them (CI/CD)This job is stuck b…

Directly related (12)

npm ci out of syncnpm

npm ERR! `npm ci` can only install packages when your package.json and package-lock.json are in sync

package-lock.json doesn’t match package.json, so npm ci refuses to install.

old lockfilenpm

npm WARN old lockfile — The package-lock.json file was created with an old version of npm, so supplemental metadata must be fetched

The lockfile is lockfileVersion 1 (npm 6) and npm 7+ is upgrading it.

No updates are to be performedAWS

CloudFormation: No updates are to be performed

You ran an update/deploy with a template and parameters identical to what’s deployed, so there’s nothing to change.

the input device is not a TTYDocker

the input device is not a TTY

docker run/exec was called with -t (allocate a terminal) in a context with no terminal — CI, cron, a pipe or a script.

Failed to find target with hash stringAndroid

Failed to find target with hash string 'android-34' / Failed to install the following Android SDK packages as some licences have not been accepted

Gradle needs an SDK platform/build-tools that isn’t installed, or the licences haven’t been accepted on this machine.

npm ci no lockfilenpm

npm ERR! The `npm ci` command can only install with an existing package-lock.json or npm-shrinkwrap.json

npm ci needs a committed lockfile and didn’t find one.

AADSTS70021Azure

AADSTS70021: No matching federated identity record found for presented assertion (GitHub Actions / workload identity)

The OIDC token from GitHub Actions/Kubernetes/another IdP doesn’t match any federated credential on the app — issuer, subject or…

EINTEGRITYnpm

npm ERR! code EINTEGRITY — sha512 integrity checksum failed

A downloaded package’s hash doesn’t match the integrity value in package-lock.json — a corrupted cache, a changed tarball, or a l…

rollup native modulenpm

Error: Cannot find module @rollup/rollup-linux-x64-gnu. npm has a bug related to optional dependencies

Rollup’s (and Vite’s) platform-specific optional dependency wasn’t installed — an npm optional-dependency bug with lockfiles from…

ERR_PNPM_OUTDATED_LOCKFILEnpm

ERR_PNPM_OUTDATED_LOCKFILE Cannot install with "frozen-lockfile" because pnpm-lock.yaml is not up to date with package.json

pnpm’s lockfile doesn’t match package.json, and CI installs with a frozen lockfile.

toomanyrequestsDocker

toomanyrequests: You have reached your pull rate limit (Docker Hub)

Docker Hub limits anonymous and free pulls; your IP or account has used its quota for the current window.

No hosted parallelismAzure

Azure Pipelines: No hosted parallelism has been purchased or granted

The Azure DevOps organization has no Microsoft-hosted parallel jobs, so pipelines can’t run on hosted agents.

Two steps away (33)

github-actions[bot] 403Git

remote: Permission to owner/repo.git denied to github-actions[bot]. fatal: unable to access … The requested URL returned error: 403

A GitHub Actions workflow tried to push but the GITHUB_TOKEN doesn’t have write permission.

Invalid Versionnpm

npm ERR! Invalid Version: (semver parse error)

A package.json or lockfile contains a version string that isn’t valid semver.

ELSPROBLEMSnpm

npm ERR! code ELSPROBLEMS — invalid / extraneous / missing packages in npm ls

npm ls found the installed tree doesn’t match package.json and the lockfile.

caching_sha2_passwordMySQL

Authentication plugin 'caching_sha2_password' cannot be loaded

An old MySQL client/driver can’t use MySQL 8’s default authentication plugin.

cb() never callednpm

npm ERR! cb() never called!

An old npm crash during install — usually network/cache corruption.

Corepack keyidnpm

Error: Cannot find matching keyid (Corepack signature verification)

An older Corepack couldn’t verify the signature of a newly published pnpm/yarn release after npm rotated its signing keys.

shallow update not allowedGit

! [remote rejected] main -> main (shallow update not allowed)

You pushed from a shallow clone to a remote that doesn’t accept shallow history.

ROLLBACK_COMPLETEAWS

Stack is in ROLLBACK_COMPLETE state and can not be updated

The stack’s first creation failed and rolled back; a stack in ROLLBACK_COMPLETE can only be deleted, not updated.

UPDATE_ROLLBACK_FAILEDAWS

CloudFormation stack in UPDATE_ROLLBACK_FAILED

An update failed, and then the rollback also failed, leaving the stack stuck until you continue the rollback.

invalid reference formatDocker

docker: invalid reference format (repository name must be lowercase)

Docker couldn’t parse the image name — uppercase letters, spaces, an empty variable, or a misplaced option.

No such containerDocker

Error response from daemon: No such container

The container name or ID you used doesn’t exist on this Docker host — it was removed, has another name, or you’re talking to a di…

is not runningDocker

Error response from daemon: Container X is not running

You tried to exec into or interact with a container that has stopped.

Could not resolveAndroid

Gradle: Could not resolve all files for configuration / Could not resolve dependency

Gradle couldn’t download a dependency — wrong coordinates/version, missing repository, offline mode, or network/proxy issues.

another operation is in progressKubernetes

Error: UPGRADE FAILED: another operation (install/upgrade/rollback) is in progress

A previous Helm operation on this release was interrupted and left it in a pending-install/pending-upgrade state, so Helm refuses…

DefaultAzureCredential failedAzure

DefaultAzureCredential failed to retrieve a token from the included credentials / ManagedIdentityCredential authentication unavailable

The Azure SDK tried every credential source (env vars, workload identity, managed identity, CLI…) and none worked.

service connection could not be foundAzure

Azure Pipelines: There was a resource authorization issue: The pipeline is not valid. Could not find a service connection with identifier x

The pipeline references a service connection that doesn’t exist in the project or isn’t authorized for this pipeline.

Gradle Java heap spaceAndroid

Gradle: Expiring Daemon because JVM heap space is exhausted / java.lang.OutOfMemoryError: Java heap space during build

The Gradle daemon (or Kotlin daemon) ran out of memory compiling or dexing the project.

Command CodeSign failediOS

Command CodeSign failed with a nonzero exit code (errSecInternalComponent / resource fork, Finder information not allowed)

codesign failed — the keychain is locked (CI/SSH), the private key is inaccessible, or files carry extended attributes that can’t…

sts:AssumeRole deniedAWS

is not authorized to perform: sts:AssumeRole on resource: arn:aws:iam::...:role/...

The caller can’t assume the role — either its own policy doesn’t allow sts:AssumeRole, or the role’s trust policy doesn’t trust t…

AADSTS50020Azure

AADSTS50020: User account from identity provider does not exist in tenant and cannot access the application

The signed-in user belongs to another tenant (or is a personal Microsoft account) and isn’t a guest in the app’s tenant.

AADSTS50034Azure

AADSTS50034: The user account does not exist in the directory

There’s no user with that sign-in name in the tenant.

ERESOLVEnpm

npm ERR! code ERESOLVE — unable to resolve dependency tree

npm 7+ found conflicting peer dependency requirements and refuses to install a broken tree.

E404npm

npm ERR! code E404 — 404 Not Found: package@version is not in this registry

npm asked the registry for a package (or version) that doesn’t exist there — a typo, a private/scoped package without auth, or th…

tarball corruptednpm

npm WARN tar TAR_ENTRY_ERROR / npm ERR! tarball data for x seems to be corrupted

A downloaded package tarball is damaged — cache corruption or a network/proxy problem.

MODULE_NOT_FOUNDNode.js

Error: Cannot find module 'x' (MODULE_NOT_FOUND)

Node can’t resolve the module path — the package isn’t installed, or a relative path/extension is wrong.

gyp ERR!npm

gyp ERR! build error / node-gyp rebuild failed

A dependency with native C/C++ code couldn’t compile — missing build tools, Python, or an unsupported Node version.

No Xcode or CLTnpm

gyp: No Xcode or CLT version detected!

node-gyp on macOS can’t find the Xcode Command Line Tools to compile native modules.

ImagePullBackOffKubernetes

Kubernetes: ImagePullBackOff / ErrImagePull

The node can’t pull the container image — wrong name/tag, missing registry credentials, or registry unreachable.

429HTTP

HTTP 429 Too Many Requests

You’ve hit a rate limit — too many requests in a given time window. Slow down and retry later.

ProvisionedThroughputExceededExceptionAWS

ProvisionedThroughputExceededException: The level of configured provisioned throughput for the table was exceeded

Requests exceed the table’s (or index’s) provisioned read/write capacity, or one partition is hot.

TF401019Azure

TF401019: The Git repository with name or identifier x does not exist or you do not have permissions for the operation

The repo doesn’t exist in that project, or the identity (user, PAT, pipeline build service) lacks permission to it.

10000Cloudflare

wrangler / Cloudflare API: Authentication error [code: 10000]

The Cloudflare API rejected the token — it’s invalid, expired, missing permissions, or scoped to another account/zone.

This job is stuck because you don't have any active runnersCI/CD

GitLab CI: This job is stuck because you don't have any active runners online or available with any of these tags assigned to them

No GitLab runner can pick up the job — runners are offline, the job’s tags don’t match any runner, or shared runners are disabled.