Error map

No signing certificate Xcode: No signing certificate "iOS Development" found

iOS · layer 1, On your device

Open the full error page →

Centre: this error. First ring: errors it is linked with (8). Outer ring: what those are linked with. Colours show the layer of a request each error belongs to. Click any dot to re-centre the map on it; hover to follow its connections. The centre dot opens the error page.

No signing certificate — Xcode: No signing certificate "iOS Development" found (iOS)No signing …PhaseScriptExecution — Xcode: Command PhaseScriptExecution failed with a nonzero exit code (iOS)PhaseScriptExecutionWindows protected your PC — Windows protected your PC — Microsoft Defender SmartScreen prevented an unrecognized app from starting (Windows)Windows protected y…INSTALL_FAILED_UPDATE_INCOMPATIBLE — Android: INSTALL_FAILED_UPDATE_INCOMPATIBLE (Android)INSTALL_FAILED_UPDA…doesn't include signing certificate — Provisioning profile "x" doesn't include signing certificate "Apple Development: Name (ID)" (iOS)doesn't include sig…doesn't include the currently selected device — Provisioning profile "x" doesn't include the currently selected device (iOS)doesn't include the…Signing requires a development team — Signing for "App" requires a development team. Select a development team in the Signing & Capabilities editor (iOS)Signing requires a …Command CodeSign failed — Command CodeSign failed with a nonzero exit code (errSecInternalComponent / resource fork, Finder information not allowed) (iOS)Command CodeSign fa…Failed to register bundle identifier — Failed to register bundle identifier: The app identifier "com.x" cannot be registered to your development team because it is not available (iOS)Failed to register …command not found — bash: command not found (Linux)command not foundCocoaPods compatible versions — CocoaPods could not find compatible versions for pod (iOS)CocoaPods compatibl…Multiple commands produce — Xcode: Multiple commands produce '…/Info.plist' (or another file) (iOS)Multiple commands p…webhook signature — Webhook signature verification failed (Stripe, Razorpay, GitHub…) (API)webhook signatureAADSTS50053 — AADSTS50053: Your account is locked (Smart Lockout) / sign-in blocked due to suspicious activity (Azure)AADSTS500531005 — Cloudflare Error 1005: Access denied — The owner of this website has banned the autonomous system number (ASN) your IP address is in (Cloudflare)1005Could not resolve — Gradle: Could not resolve all files for configuration / Could not resolve dependency (Android)Could not resolvegpg failed to sign — error: gpg failed to sign the data — fatal: failed to write commit object (Git)gpg failed to signINSTALL_FAILED_INSUFFICIENT_STORAGE — INSTALL_FAILED_INSUFFICIENT_STORAGE: Failure [INSTALL_FAILED_INSUFFICIENT_STORAGE] (Android)INSTALL_FAILED_INSU…526 — Cloudflare Error 526: Invalid SSL Certificate (Cloudflare)526Untrusted Developer — Could not launch "App": process launch failed: Security / Untrusted Developer (iOS)Untrusted Developerintegrity could not be verified — Unable to Install "App": This app cannot be installed because its integrity could not be verified (iOS)integrity could not…Failed to prepare device for development — Xcode: Failed to prepare device for development / iPhone is not available. Please reconnect the device (iOS)Failed to prepare d…No such module — Swift: No such module 'X' (module not found) (iOS)No such moduleUndefined symbols for architecture — Undefined symbol(s) for architecture arm64 — linker command failed with exit code 1 (iOS)Undefined symbols f…ITMS-90725 — ITMS-90725: SDK version issue — This app was built with the iOS 17.x SDK. All iOS apps submitted to the App Store must be built with the iOS 18 SDK or later (iOS)ITMS-90725shallow update not allowed — ! [remote rejected] main -> main (shallow update not allowed) (Git)shallow update not …github-actions[bot] 403 — remote: Permission to owner/repo.git denied to github-actions[bot]. fatal: unable to access … The requested URL returned error: 403 (Git)github-actions[bot]…npm ci out of sync — npm ERR! `npm ci` can only install packages when your package.json and package-lock.json are in sync (npm)npm ci out of sync

Directly related (8)

PhaseScriptExecutioniOS

Xcode: Command PhaseScriptExecution failed with a nonzero exit code

A Run Script build phase (CocoaPods, React Native, Flutter, SwiftLint, Crashlytics…) failed. The real error is above this line in…

Windows protected your PCWindows

Windows protected your PC — Microsoft Defender SmartScreen prevented an unrecognized app from starting

SmartScreen blocked an app that’s unsigned or new/rare (no download reputation yet).

INSTALL_FAILED_UPDATE_INCOMPATIBLEAndroid

Android: INSTALL_FAILED_UPDATE_INCOMPATIBLE

An app with the same package name but a different signing key is already installed on the device.

doesn't include signing certificateiOS

Provisioning profile "x" doesn't include signing certificate "Apple Development: Name (ID)"

The profile was created with a different certificate than the one installed in your keychain.

doesn't include the currently selected deviceiOS

Provisioning profile "x" doesn't include the currently selected device

The development profile doesn’t list this iPhone’s UDID, so Xcode can’t install the build on it.

Signing requires a development teamiOS

Signing for "App" requires a development team. Select a development team in the Signing & Capabilities editor

No Apple developer team is selected for the target, so Xcode can’t sign the app.

Command CodeSign failediOS

Command CodeSign failed with a nonzero exit code (errSecInternalComponent / resource fork, Finder information not allowed)

codesign failed — the keychain is locked (CI/SSH), the private key is inaccessible, or files carry extended attributes that can’t…

Failed to register bundle identifieriOS

Failed to register bundle identifier: The app identifier "com.x" cannot be registered to your development team because it is not available

Another developer team already owns that bundle identifier, so Xcode can’t create it for your team.

Two steps away (19)

command not foundLinux

bash: command not found

The shell can’t find an executable with that name in any directory on your PATH.

CocoaPods compatible versionsiOS

CocoaPods could not find compatible versions for pod

pod install can’t satisfy the version constraints — outdated spec repo, a higher deployment target required, or two pods needing…

Multiple commands produceiOS

Xcode: Multiple commands produce '…/Info.plist' (or another file)

Two build steps write the same output file — usually Info.plist or an asset added to “Copy Bundle Resources”, or duplicate files…

webhook signatureAPI

Webhook signature verification failed (Stripe, Razorpay, GitHub…)

Your endpoint computed a different HMAC signature than the one the provider sent, so the webhook is rejected.

AADSTS50053Azure

AADSTS50053: Your account is locked (Smart Lockout) / sign-in blocked due to suspicious activity

Too many failed sign-ins (or sign-ins from a malicious IP) triggered Entra Smart Lockout.

1005Cloudflare

Cloudflare Error 1005: Access denied — The owner of this website has banned the autonomous system number (ASN) your IP address is in

The site owner blocked your network provider (ASN) — common for VPNs, cloud/data-center IPs and some mobile carriers.

Could not resolveAndroid

Gradle: Could not resolve all files for configuration / Could not resolve dependency

Gradle couldn’t download a dependency — wrong coordinates/version, missing repository, offline mode, or network/proxy issues.

gpg failed to signGit

error: gpg failed to sign the data — fatal: failed to write commit object

Commit signing is enabled but GPG couldn’t sign — no TTY for the passphrase, wrong key, or agent not running.

INSTALL_FAILED_INSUFFICIENT_STORAGEAndroid

INSTALL_FAILED_INSUFFICIENT_STORAGE: Failure [INSTALL_FAILED_INSUFFICIENT_STORAGE]

The device or emulator doesn’t have enough free internal storage to install the APK.

526Cloudflare

Cloudflare Error 526: Invalid SSL Certificate

With SSL mode Full (strict), the origin’s certificate is expired, self-signed, or doesn’t match the hostname.

Untrusted DeveloperiOS

Could not launch "App": process launch failed: Security / Untrusted Developer

The app installed, but iOS won’t run it because the developer certificate hasn’t been trusted on the device (common with free/ent…

integrity could not be verifiediOS

Unable to Install "App": This app cannot be installed because its integrity could not be verified

iOS rejected the app because its signature doesn’t validate for this device — expired/revoked certificate, ad-hoc profile without…

Failed to prepare device for developmentiOS

Xcode: Failed to prepare device for development / iPhone is not available. Please reconnect the device

Xcode couldn’t set up the device — usually the device’s iOS version is newer than Xcode supports, Developer Mode is off, or pairi…

No such moduleiOS

Swift: No such module 'X' (module not found)

Xcode can’t find a Swift package, pod or framework you import.

Undefined symbols for architectureiOS

Undefined symbol(s) for architecture arm64 — linker command failed with exit code 1

The linker can’t find the implementation of a symbol your code uses — a missing framework/library, a file not in the target, or a…

ITMS-90725iOS

ITMS-90725: SDK version issue — This app was built with the iOS 17.x SDK. All iOS apps submitted to the App Store must be built with the iOS 18 SDK or later

App Store Connect requires uploads to be built with a recent Xcode/iOS SDK (raised every spring).

shallow update not allowedGit

! [remote rejected] main -> main (shallow update not allowed)

You pushed from a shallow clone to a remote that doesn’t accept shallow history.

github-actions[bot] 403Git

remote: Permission to owner/repo.git denied to github-actions[bot]. fatal: unable to access … The requested URL returned error: 403

A GitHub Actions workflow tried to push but the GITHUB_TOKEN doesn’t have write permission.

npm ci out of syncnpm

npm ERR! `npm ci` can only install packages when your package.json and package-lock.json are in sync

package-lock.json doesn’t match package.json, so npm ci refuses to install.