Error map

doesn't include the currently selected device Provisioning profile "x" doesn't include the currently selected device

iOS · layer 1, On your device

Open the full error page →

Centre: this error. First ring: errors it is linked with (8). Outer ring: what those are linked with. Colours show the layer of a request each error belongs to. Click any dot to re-centre the map on it; hover to follow its connections. The centre dot opens the error page.

doesn't include the currently selected device — Provisioning profile "x" doesn't include the currently selected device (iOS)doesn't inc…Failed to prepare device for development — Xcode: Failed to prepare device for development / iPhone is not available. Please reconnect the device (iOS)Failed to prepare d…No signing certificate — Xcode: No signing certificate "iOS Development" found (iOS)No signing certific…integrity could not be verified — Unable to Install "App": This app cannot be installed because its integrity could not be verified (iOS)integrity could not…doesn't include signing certificate — Provisioning profile "x" doesn't include signing certificate "Apple Development: Name (ID)" (iOS)doesn't include sig…Untrusted Developer — Could not launch "App": process launch failed: Security / Untrusted Developer (iOS)Untrusted DeveloperSigning requires a development team — Signing for "App" requires a development team. Select a development team in the Signing & Capabilities editor (iOS)Signing requires a …Command CodeSign failed — Command CodeSign failed with a nonzero exit code (errSecInternalComponent / resource fork, Finder information not allowed) (iOS)Command CodeSign fa…Failed to register bundle identifier — Failed to register bundle identifier: The app identifier "com.x" cannot be registered to your development team because it is not available (iOS)Failed to register …No such module — Swift: No such module 'X' (module not found) (iOS)No such moduleUndefined symbols for architecture — Undefined symbol(s) for architecture arm64 — linker command failed with exit code 1 (iOS)Undefined symbols f…ITMS-90725 — ITMS-90725: SDK version issue — This app was built with the iOS 17.x SDK. All iOS apps submitted to the App Store must be built with the iOS 18 SDK or later (iOS)ITMS-90725INSTALL_FAILED_UPDATE_INCOMPATIBLE — Android: INSTALL_FAILED_UPDATE_INCOMPATIBLE (Android)INSTALL_FAILED_UPDA…PhaseScriptExecution — Xcode: Command PhaseScriptExecution failed with a nonzero exit code (iOS)PhaseScriptExecutionWindows protected your PC — Windows protected your PC — Microsoft Defender SmartScreen prevented an unrecognized app from starting (Windows)Windows protected y…ApiException: 10 — Google Sign-In: com.google.android.gms.common.api.ApiException: 10 (DEVELOPER_ERROR) (Android)ApiException: 10NSUnknownKeyException — NSUnknownKeyException: this class is not key value coding-compliant for the key x (iOS)NSUnknownKeyExcepti…unable to dequeue a cell with identifier — unable to dequeue a cell with identifier Cell - must register a nib or a class for the identifier or connect a prototype cell in a storyboard (iOS)unable to dequeue a…526 — Cloudflare Error 526: Invalid SSL Certificate (Cloudflare)526Challenge failed for domain — Let’s Encrypt / Certbot: Challenge failed for domain example.com — Invalid response from http://example.com/.well-known/acme-challenge/x: 404 (SSL / TLS)Challenge failed fo…NET::ERR_CERT_COMMON_NAME_INVALID — NET::ERR_CERT_COMMON_NAME_INVALID: Your connection is not private (certificate is for a different domain) (SSL / TLS)NET::ERR_CERT_COMMO…adb unauthorized — adb: device unauthorized. This adb server's $ADB_VENDOR_KEYS is not set (Android)adb unauthorizedno devices/emulators found — adb: no devices/emulators found / error: device not found (Android)no devices/emulator…Cannot preview in this file — SwiftUI Preview: Cannot preview in this file — the preview crashed / failed to build (iOS)Cannot preview in t…invalid active developer path — xcrun: error: invalid active developer path (/Library/Developer/CommandLineTools), missing xcrun (iOS)invalid active deve…shallow update not allowed — ! [remote rejected] main -> main (shallow update not allowed) (Git)shallow update not …github-actions[bot] 403 — remote: Permission to owner/repo.git denied to github-actions[bot]. fatal: unable to access … The requested URL returned error: 403 (Git)github-actions[bot]…npm ci out of sync — npm ERR! `npm ci` can only install packages when your package.json and package-lock.json are in sync (npm)npm ci out of sync

Directly related (8)

Failed to prepare device for developmentiOS

Xcode: Failed to prepare device for development / iPhone is not available. Please reconnect the device

Xcode couldn’t set up the device — usually the device’s iOS version is newer than Xcode supports, Developer Mode is off, or pairi…

No signing certificateiOS

Xcode: No signing certificate "iOS Development" found

Xcode can’t find a valid code-signing certificate + private key for the selected team in your keychain.

integrity could not be verifiediOS

Unable to Install "App": This app cannot be installed because its integrity could not be verified

iOS rejected the app because its signature doesn’t validate for this device — expired/revoked certificate, ad-hoc profile without…

doesn't include signing certificateiOS

Provisioning profile "x" doesn't include signing certificate "Apple Development: Name (ID)"

The profile was created with a different certificate than the one installed in your keychain.

Untrusted DeveloperiOS

Could not launch "App": process launch failed: Security / Untrusted Developer

The app installed, but iOS won’t run it because the developer certificate hasn’t been trusted on the device (common with free/ent…

Signing requires a development teamiOS

Signing for "App" requires a development team. Select a development team in the Signing & Capabilities editor

No Apple developer team is selected for the target, so Xcode can’t sign the app.

Command CodeSign failediOS

Command CodeSign failed with a nonzero exit code (errSecInternalComponent / resource fork, Finder information not allowed)

codesign failed — the keychain is locked (CI/SSH), the private key is inaccessible, or files carry extended attributes that can’t…

Failed to register bundle identifieriOS

Failed to register bundle identifier: The app identifier "com.x" cannot be registered to your development team because it is not available

Another developer team already owns that bundle identifier, so Xcode can’t create it for your team.

Two steps away (19)

No such moduleiOS

Swift: No such module 'X' (module not found)

Xcode can’t find a Swift package, pod or framework you import.

Undefined symbols for architectureiOS

Undefined symbol(s) for architecture arm64 — linker command failed with exit code 1

The linker can’t find the implementation of a symbol your code uses — a missing framework/library, a file not in the target, or a…

ITMS-90725iOS

ITMS-90725: SDK version issue — This app was built with the iOS 17.x SDK. All iOS apps submitted to the App Store must be built with the iOS 18 SDK or later

App Store Connect requires uploads to be built with a recent Xcode/iOS SDK (raised every spring).

INSTALL_FAILED_UPDATE_INCOMPATIBLEAndroid

Android: INSTALL_FAILED_UPDATE_INCOMPATIBLE

An app with the same package name but a different signing key is already installed on the device.

PhaseScriptExecutioniOS

Xcode: Command PhaseScriptExecution failed with a nonzero exit code

A Run Script build phase (CocoaPods, React Native, Flutter, SwiftLint, Crashlytics…) failed. The real error is above this line in…

Windows protected your PCWindows

Windows protected your PC — Microsoft Defender SmartScreen prevented an unrecognized app from starting

SmartScreen blocked an app that’s unsigned or new/rare (no download reputation yet).

ApiException: 10Android

Google Sign-In: com.google.android.gms.common.api.ApiException: 10 (DEVELOPER_ERROR)

Google Sign-In is misconfigured — the app’s package name or SHA-1/SHA-256 signing fingerprint isn’t registered in Google Cloud/Fi…

NSUnknownKeyExceptioniOS

NSUnknownKeyException: this class is not key value coding-compliant for the key x

A storyboard/XIB has a connection to an outlet or action that no longer exists in the class (renamed or deleted), or the view’s c…

unable to dequeue a cell with identifieriOS

unable to dequeue a cell with identifier Cell - must register a nib or a class for the identifier or connect a prototype cell in a storyboard

The table/collection view was asked for a reusable cell identifier that was never registered.

526Cloudflare

Cloudflare Error 526: Invalid SSL Certificate

With SSL mode Full (strict), the origin’s certificate is expired, self-signed, or doesn’t match the hostname.

Challenge failed for domainSSL / TLS

Let’s Encrypt / Certbot: Challenge failed for domain example.com — Invalid response from http://example.com/.well-known/acme-challenge/x: 404

Let’s Encrypt couldn’t verify you control the domain — the HTTP-01 challenge file wasn’t served, or DNS points elsewhere.

NET::ERR_CERT_COMMON_NAME_INVALIDSSL / TLS

NET::ERR_CERT_COMMON_NAME_INVALID: Your connection is not private (certificate is for a different domain)

The certificate presented doesn’t include the hostname you visited — e.g. visiting www.example.com with a certificate only for ex…

adb unauthorizedAndroid

adb: device unauthorized. This adb server's $ADB_VENDOR_KEYS is not set

The phone hasn’t accepted your computer’s RSA key for USB debugging yet.

no devices/emulators foundAndroid

adb: no devices/emulators found / error: device not found

adb can’t see any connected device or running emulator.

Cannot preview in this fileiOS

SwiftUI Preview: Cannot preview in this file — the preview crashed / failed to build

Xcode Previews couldn’t build or run the view — compile errors elsewhere, a crash in preview data, or preview-specific environmen…

invalid active developer pathiOS

xcrun: error: invalid active developer path (/Library/Developer/CommandLineTools), missing xcrun

The Xcode Command Line Tools are missing or broken — typical right after a macOS update.

shallow update not allowedGit

! [remote rejected] main -> main (shallow update not allowed)

You pushed from a shallow clone to a remote that doesn’t accept shallow history.

github-actions[bot] 403Git

remote: Permission to owner/repo.git denied to github-actions[bot]. fatal: unable to access … The requested URL returned error: 403

A GitHub Actions workflow tried to push but the GITHUB_TOKEN doesn’t have write permission.

npm ci out of syncnpm

npm ERR! `npm ci` can only install packages when your package.json and package-lock.json are in sync

package-lock.json doesn’t match package.json, so npm ci refuses to install.