Error map

ITMS-90725 ITMS-90725: SDK version issue — This app was built with the iOS 17.x SDK. All iOS apps submitted to the App Store must be built with the iOS 18 SDK or later

iOS · layer 1, On your device

Open the full error page →

Centre: this error. First ring: errors it is linked with (11). Outer ring: what those are linked with. Colours show the layer of a request each error belongs to. Click any dot to re-centre the map on it; hover to follow its connections. The centre dot opens the error page.

ITMS-90725 — ITMS-90725: SDK version issue — This app was built with the iOS 17.x SDK. All iOS apps submitted to the App Store must be built with the iOS 18 SDK or later (iOS)ITMS-90725Failed to prepare device for development — Xcode: Failed to prepare device for development / iPhone is not available. Please reconnect the device (iOS)Failed to prepare d…ITMS-91053 — ITMS-91053: Missing API declaration — Your app's code references required reason APIs (privacy manifest) (iOS)ITMS-91053ITMS-90683 — ITMS-90683: Missing purpose string in Info.plist (NSCameraUsageDescription etc.) (iOS)ITMS-90683ITMS-90717 — ITMS-90717: Invalid App Store Icon. The App Store Icon in the asset catalog can't be transparent nor contain an alpha channel (iOS)ITMS-90717Cannot preview in this file — SwiftUI Preview: Cannot preview in this file — the preview crashed / failed to build (iOS)Cannot preview in t…Undefined symbols for architecture — Undefined symbol(s) for architecture arm64 — linker command failed with exit code 1 (iOS)Undefined symbols f…ITMS-90206 — ITMS-90206: Invalid Bundle. The bundle at 'App.appex' contains disallowed file 'Frameworks' (iOS)ITMS-90206Signing requires a development team — Signing for "App" requires a development team. Select a development team in the Signing & Capabilities editor (iOS)Signing requires a …No such module — Swift: No such module 'X' (module not found) (iOS)No such moduleRedundant Binary Upload — ITMS-4238: Redundant Binary Upload. You've already uploaded a build with build number 'x' for version number 'y' (iOS)Redundant Binary Up…invalid active developer path — xcrun: error: invalid active developer path (/Library/Developer/CommandLineTools), missing xcrun (iOS)invalid active deve…doesn't include the currently selected device — Provisioning profile "x" doesn't include the currently selected device (iOS)doesn't include the…Untrusted Developer — Could not launch "App": process launch failed: Security / Untrusted Developer (iOS)Untrusted Developerattempted to access privacy-sensitive data without a usage description — This app has crashed because it attempted to access privacy-sensitive data without a usage description (iOS)attempted to access…Operation not permitted (macOS privacy) — macOS: Operation not permitted — Terminal/app lacks Full Disk Access (TCC privacy protection) (macOS)Operation not permi…not allowed to query for scheme — -canOpenURL: failed for URL: "x://" - error: "This app is not allowed to query for scheme x" (iOS)not allowed to quer…ATS — App Transport Security has blocked a cleartext HTTP resource load (iOS)ATSintegrity could not be verified — Unable to Install "App": This app cannot be installed because its integrity could not be verified (iOS)integrity could not…Unexpectedly found nil — Fatal error: Unexpectedly found nil while unwrapping an Optional value (iOS)Unexpectedly found …Modifying state during view update — SwiftUI: Modifying state during view update, this will cause undefined behavior (iOS)Modifying state dur…Publishing changes from background threads — SwiftUI: Publishing changes from background threads is not allowed; make sure to publish values from the main thread (iOS)Publishing changes …built for iOS, linking for simulator — Building for iOS Simulator, but linking in object file built for iOS, for architecture arm64 (iOS)built for iOS, link…library not found for -lPods — ld: library not found for -lPods-AppName / framework not found Pods_App (iOS)library not found f…dyld: Library not loaded — dyld: Library not loaded: @rpath/X.framework/X — Reason: image not found (crash on launch) (iOS)dyld: Library not l…Call to undefined function — PHP Fatal error: Uncaught Error: Call to undefined function (PHP)Call to undefined f…could not find driver — PDOException: could not find driver (PHP)could not find driv…GD missing — Fatal error: Uncaught Error: Call to undefined function imagecreatefromjpeg() (PHP)GD missingNo signing certificate — Xcode: No signing certificate "iOS Development" found (iOS)No signing certific…Failed to register bundle identifier — Failed to register bundle identifier: The app identifier "com.x" cannot be registered to your development team because it is not available (iOS)Failed to register …doesn't include signing certificate — Provisioning profile "x" doesn't include signing certificate "Apple Development: Name (ID)" (iOS)doesn't include sig…CocoaPods compatible versions — CocoaPods could not find compatible versions for pod (iOS)CocoaPods compatibl…Unable to find a specification — [!] Unable to find a specification for `X` depended upon by `Y` (iOS)Unable to find a sp…is only available in iOS x or newer — Swift: 'X' is only available in iOS 16.0 or newer (iOS)is only available i…Version code has already been used — Play Console: Version code 1 has already been used. Try another version code (Android)Version code has al…Command CodeSign failed — Command CodeSign failed with a nonzero exit code (errSecInternalComponent / resource fork, Finder information not allowed) (iOS)Command CodeSign fa…command not found — bash: command not found (Linux)command not foundNo Xcode or CLT — gyp: No Xcode or CLT version detected! (npm)No Xcode or CLTzsh: command not found: brew — macOS: zsh: command not found: brew (Homebrew not on PATH on Apple Silicon) (macOS)zsh: command not fo…

Directly related (11)

Failed to prepare device for developmentiOS

Xcode: Failed to prepare device for development / iPhone is not available. Please reconnect the device

Xcode couldn’t set up the device — usually the device’s iOS version is newer than Xcode supports, Developer Mode is off, or pairi…

ITMS-91053iOS

ITMS-91053: Missing API declaration — Your app's code references required reason APIs (privacy manifest)

The app (or an SDK in it) uses “required reason” APIs like UserDefaults, file timestamps or disk space without declaring reasons…

ITMS-90683iOS

ITMS-90683: Missing purpose string in Info.plist (NSCameraUsageDescription etc.)

The binary references a privacy-sensitive API, but Info.plist lacks the matching usage description.

ITMS-90717iOS

ITMS-90717: Invalid App Store Icon. The App Store Icon in the asset catalog can't be transparent nor contain an alpha channel

The 1024×1024 App Store icon has an alpha channel/transparency, which App Store Connect rejects.

Cannot preview in this fileiOS

SwiftUI Preview: Cannot preview in this file — the preview crashed / failed to build

Xcode Previews couldn’t build or run the view — compile errors elsewhere, a crash in preview data, or preview-specific environmen…

Undefined symbols for architectureiOS

Undefined symbol(s) for architecture arm64 — linker command failed with exit code 1

The linker can’t find the implementation of a symbol your code uses — a missing framework/library, a file not in the target, or a…

ITMS-90206iOS

ITMS-90206: Invalid Bundle. The bundle at 'App.appex' contains disallowed file 'Frameworks'

An app extension (or framework) embeds its own Frameworks folder; only the main app may embed frameworks.

Signing requires a development teamiOS

Signing for "App" requires a development team. Select a development team in the Signing & Capabilities editor

No Apple developer team is selected for the target, so Xcode can’t sign the app.

No such moduleiOS

Swift: No such module 'X' (module not found)

Xcode can’t find a Swift package, pod or framework you import.

Redundant Binary UploadiOS

ITMS-4238: Redundant Binary Upload. You've already uploaded a build with build number 'x' for version number 'y'

The build number (CFBundleVersion) has already been used for that version in App Store Connect.

invalid active developer pathiOS

xcrun: error: invalid active developer path (/Library/Developer/CommandLineTools), missing xcrun

The Xcode Command Line Tools are missing or broken — typical right after a macOS update.

Two steps away (27)

doesn't include the currently selected deviceiOS

Provisioning profile "x" doesn't include the currently selected device

The development profile doesn’t list this iPhone’s UDID, so Xcode can’t install the build on it.

Untrusted DeveloperiOS

Could not launch "App": process launch failed: Security / Untrusted Developer

The app installed, but iOS won’t run it because the developer certificate hasn’t been trusted on the device (common with free/ent…

attempted to access privacy-sensitive data without a usage descriptioniOS

This app has crashed because it attempted to access privacy-sensitive data without a usage description

The app requested camera, photos, microphone, location, contacts, etc. without the required NS…UsageDescription in Info.plist, so…

Operation not permitted (macOS privacy)macOS

macOS: Operation not permitted — Terminal/app lacks Full Disk Access (TCC privacy protection)

macOS privacy protection (TCC) blocked access to protected folders (Desktop, Documents, Downloads, Mail, Photos, external volumes…

not allowed to query for schemeiOS

-canOpenURL: failed for URL: "x://" - error: "This app is not allowed to query for scheme x"

The app called canOpenURL for a scheme not listed in LSApplicationQueriesSchemes in Info.plist.

ATSiOS

App Transport Security has blocked a cleartext HTTP resource load

iOS blocked an `http://` request (or a weak-TLS HTTPS one) because App Transport Security requires secure connections.

integrity could not be verifiediOS

Unable to Install "App": This app cannot be installed because its integrity could not be verified

iOS rejected the app because its signature doesn’t validate for this device — expired/revoked certificate, ad-hoc profile without…

Unexpectedly found niliOS

Fatal error: Unexpectedly found nil while unwrapping an Optional value

Swift force-unwrapped (`!`) an optional that was nil, crashing the app.

Modifying state during view updateiOS

SwiftUI: Modifying state during view update, this will cause undefined behavior

A @State/@Published value was changed while SwiftUI was computing a view’s body.

Publishing changes from background threadsiOS

SwiftUI: Publishing changes from background threads is not allowed; make sure to publish values from the main thread

An ObservableObject’s @Published property was updated from a background thread.

built for iOS, linking for simulatoriOS

Building for iOS Simulator, but linking in object file built for iOS, for architecture arm64

A library contains device-only arm64 code; Apple Silicon simulators also run arm64 and need a separate simulator slice.

library not found for -lPodsiOS

ld: library not found for -lPods-AppName / framework not found Pods_App

The linker can’t find the CocoaPods library — usually because the .xcodeproj was opened instead of the .xcworkspace, or pods were…

dyld: Library not loadediOS

dyld: Library not loaded: @rpath/X.framework/X — Reason: image not found (crash on launch)

A dynamic framework the app needs at runtime isn’t embedded in the app bundle, so it crashes at launch.

Call to undefined functionPHP

PHP Fatal error: Uncaught Error: Call to undefined function

PHP can’t find the function you called — usually a missing extension, missing include, or namespace issue.

could not find driverPHP

PDOException: could not find driver

The PDO driver for your database (pdo_mysql, pdo_pgsql, pdo_sqlite) isn’t installed or enabled.

GD missingPHP

Fatal error: Uncaught Error: Call to undefined function imagecreatefromjpeg()

The GD extension (or its JPEG/WebP support) isn’t installed for the PHP version serving the site.

No signing certificateiOS

Xcode: No signing certificate "iOS Development" found

Xcode can’t find a valid code-signing certificate + private key for the selected team in your keychain.

Failed to register bundle identifieriOS

Failed to register bundle identifier: The app identifier "com.x" cannot be registered to your development team because it is not available

Another developer team already owns that bundle identifier, so Xcode can’t create it for your team.

doesn't include signing certificateiOS

Provisioning profile "x" doesn't include signing certificate "Apple Development: Name (ID)"

The profile was created with a different certificate than the one installed in your keychain.

CocoaPods compatible versionsiOS

CocoaPods could not find compatible versions for pod

pod install can’t satisfy the version constraints — outdated spec repo, a higher deployment target required, or two pods needing…

Unable to find a specificationiOS

[!] Unable to find a specification for `X` depended upon by `Y`

CocoaPods can’t find the pod (or version) in its spec repos — stale local specs, a private spec repo not added, or a typo.

is only available in iOS x or neweriOS

Swift: 'X' is only available in iOS 16.0 or newer

You used an API that requires a newer iOS than your deployment target.

Version code has already been usedAndroid

Play Console: Version code 1 has already been used. Try another version code

Every upload to a Play app needs a higher versionCode than any previous upload (in any track).

Command CodeSign failediOS

Command CodeSign failed with a nonzero exit code (errSecInternalComponent / resource fork, Finder information not allowed)

codesign failed — the keychain is locked (CI/SSH), the private key is inaccessible, or files carry extended attributes that can’t…

command not foundLinux

bash: command not found

The shell can’t find an executable with that name in any directory on your PATH.

No Xcode or CLTnpm

gyp: No Xcode or CLT version detected!

node-gyp on macOS can’t find the Xcode Command Line Tools to compile native modules.

zsh: command not found: brewmacOS

macOS: zsh: command not found: brew (Homebrew not on PATH on Apple Silicon)

Homebrew is installed in /opt/homebrew on Apple Silicon Macs, which isn’t on PATH until you add its shellenv line.