Error map

Redundant Binary Upload ITMS-4238: Redundant Binary Upload. You've already uploaded a build with build number 'x' for version number 'y'

iOS · layer 1, On your device

Open the full error page →

Centre: this error. First ring: errors it is linked with (7). Outer ring: what those are linked with. Colours show the layer of a request each error belongs to. Click any dot to re-centre the map on it; hover to follow its connections. The centre dot opens the error page.

Redundant Binary Upload — ITMS-4238: Redundant Binary Upload. You've already uploaded a build with build number 'x' for version number 'y' (iOS)Redundant B…Version code has already been used — Play Console: Version code 1 has already been used. Try another version code (Android)Version code has al…ITMS-90725 — ITMS-90725: SDK version issue — This app was built with the iOS 17.x SDK. All iOS apps submitted to the App Store must be built with the iOS 18 SDK or later (iOS)ITMS-90725ITMS-91053 — ITMS-91053: Missing API declaration — Your app's code references required reason APIs (privacy manifest) (iOS)ITMS-91053ITMS-90683 — ITMS-90683: Missing purpose string in Info.plist (NSCameraUsageDescription etc.) (iOS)ITMS-90683ITMS-90717 — ITMS-90717: Invalid App Store Icon. The App Store Icon in the asset catalog can't be transparent nor contain an alpha channel (iOS)ITMS-90717ITMS-90206 — ITMS-90206: Invalid Bundle. The bundle at 'App.appex' contains disallowed file 'Frameworks' (iOS)ITMS-90206Command CodeSign failed — Command CodeSign failed with a nonzero exit code (errSecInternalComponent / resource fork, Finder information not allowed) (iOS)Command CodeSign fa…adb unauthorized — adb: device unauthorized. This adb server's $ADB_VENDOR_KEYS is not set (Android)adb unauthorizedandroid:attr/lStar not found — AAPT: error: resource android:attr/lStar not found (Android)android:attr/lStar …Android resource linking failed — AAPT: error: resource x (aka y) not found — Android resource linking failed (Android)Android resource li…Signing requires a development team — Signing for "App" requires a development team. Select a development team in the Signing & Capabilities editor (iOS)Signing requires a …No such module — Swift: No such module 'X' (module not found) (iOS)No such moduleUndefined symbols for architecture — Undefined symbol(s) for architecture arm64 — linker command failed with exit code 1 (iOS)Undefined symbols f…attempted to access privacy-sensitive data without a usage description — This app has crashed because it attempted to access privacy-sensitive data without a usage description (iOS)attempted to access…Operation not permitted (macOS privacy) — macOS: Operation not permitted — Terminal/app lacks Full Disk Access (TCC privacy protection) (macOS)Operation not permi…not allowed to query for scheme — -canOpenURL: failed for URL: "x://" - error: "This app is not allowed to query for scheme x" (iOS)not allowed to quer…ATS — App Transport Security has blocked a cleartext HTTP resource load (iOS)ATSintegrity could not be verified — Unable to Install "App": This app cannot be installed because its integrity could not be verified (iOS)integrity could not…Call to undefined function — PHP Fatal error: Uncaught Error: Call to undefined function (PHP)Call to undefined f…could not find driver — PDOException: could not find driver (PHP)could not find driv…GD missing — Fatal error: Uncaught Error: Call to undefined function imagecreatefromjpeg() (PHP)GD missingNo signing certificate — Xcode: No signing certificate "iOS Development" found (iOS)No signing certific…shallow update not allowed — ! [remote rejected] main -> main (shallow update not allowed) (Git)shallow update not …github-actions[bot] 403 — remote: Permission to owner/repo.git denied to github-actions[bot]. fatal: unable to access … The requested URL returned error: 403 (Git)github-actions[bot]…

Directly related (7)

Version code has already been usedAndroid

Play Console: Version code 1 has already been used. Try another version code

Every upload to a Play app needs a higher versionCode than any previous upload (in any track).

ITMS-90725iOS

ITMS-90725: SDK version issue — This app was built with the iOS 17.x SDK. All iOS apps submitted to the App Store must be built with the iOS 18 SDK or later

App Store Connect requires uploads to be built with a recent Xcode/iOS SDK (raised every spring).

ITMS-91053iOS

ITMS-91053: Missing API declaration — Your app's code references required reason APIs (privacy manifest)

The app (or an SDK in it) uses “required reason” APIs like UserDefaults, file timestamps or disk space without declaring reasons…

ITMS-90683iOS

ITMS-90683: Missing purpose string in Info.plist (NSCameraUsageDescription etc.)

The binary references a privacy-sensitive API, but Info.plist lacks the matching usage description.

ITMS-90717iOS

ITMS-90717: Invalid App Store Icon. The App Store Icon in the asset catalog can't be transparent nor contain an alpha channel

The 1024×1024 App Store icon has an alpha channel/transparency, which App Store Connect rejects.

ITMS-90206iOS

ITMS-90206: Invalid Bundle. The bundle at 'App.appex' contains disallowed file 'Frameworks'

An app extension (or framework) embeds its own Frameworks folder; only the main app may embed frameworks.

Command CodeSign failediOS

Command CodeSign failed with a nonzero exit code (errSecInternalComponent / resource fork, Finder information not allowed)

codesign failed — the keychain is locked (CI/SSH), the private key is inaccessible, or files carry extended attributes that can’t…

Two steps away (17)

adb unauthorizedAndroid

adb: device unauthorized. This adb server's $ADB_VENDOR_KEYS is not set

The phone hasn’t accepted your computer’s RSA key for USB debugging yet.

android:attr/lStar not foundAndroid

AAPT: error: resource android:attr/lStar not found

A dependency (androidx.core 1.7+) uses an attribute from Android 12 (API 31), but your module compiles against an older compileSd…

Android resource linking failedAndroid

AAPT: error: resource x (aka y) not found — Android resource linking failed

A layout, manifest or style references a resource (drawable, string, style, attribute) that doesn’t exist in the module or its de…

Signing requires a development teamiOS

Signing for "App" requires a development team. Select a development team in the Signing & Capabilities editor

No Apple developer team is selected for the target, so Xcode can’t sign the app.

No such moduleiOS

Swift: No such module 'X' (module not found)

Xcode can’t find a Swift package, pod or framework you import.

Undefined symbols for architectureiOS

Undefined symbol(s) for architecture arm64 — linker command failed with exit code 1

The linker can’t find the implementation of a symbol your code uses — a missing framework/library, a file not in the target, or a…

attempted to access privacy-sensitive data without a usage descriptioniOS

This app has crashed because it attempted to access privacy-sensitive data without a usage description

The app requested camera, photos, microphone, location, contacts, etc. without the required NS…UsageDescription in Info.plist, so…

Operation not permitted (macOS privacy)macOS

macOS: Operation not permitted — Terminal/app lacks Full Disk Access (TCC privacy protection)

macOS privacy protection (TCC) blocked access to protected folders (Desktop, Documents, Downloads, Mail, Photos, external volumes…

not allowed to query for schemeiOS

-canOpenURL: failed for URL: "x://" - error: "This app is not allowed to query for scheme x"

The app called canOpenURL for a scheme not listed in LSApplicationQueriesSchemes in Info.plist.

ATSiOS

App Transport Security has blocked a cleartext HTTP resource load

iOS blocked an `http://` request (or a weak-TLS HTTPS one) because App Transport Security requires secure connections.

integrity could not be verifiediOS

Unable to Install "App": This app cannot be installed because its integrity could not be verified

iOS rejected the app because its signature doesn’t validate for this device — expired/revoked certificate, ad-hoc profile without…

Call to undefined functionPHP

PHP Fatal error: Uncaught Error: Call to undefined function

PHP can’t find the function you called — usually a missing extension, missing include, or namespace issue.

could not find driverPHP

PDOException: could not find driver

The PDO driver for your database (pdo_mysql, pdo_pgsql, pdo_sqlite) isn’t installed or enabled.

GD missingPHP

Fatal error: Uncaught Error: Call to undefined function imagecreatefromjpeg()

The GD extension (or its JPEG/WebP support) isn’t installed for the PHP version serving the site.

No signing certificateiOS

Xcode: No signing certificate "iOS Development" found

Xcode can’t find a valid code-signing certificate + private key for the selected team in your keychain.

shallow update not allowedGit

! [remote rejected] main -> main (shallow update not allowed)

You pushed from a shallow clone to a remote that doesn’t accept shallow history.

github-actions[bot] 403Git

remote: Permission to owner/repo.git denied to github-actions[bot]. fatal: unable to access … The requested URL returned error: 403

A GitHub Actions workflow tried to push but the GITHUB_TOKEN doesn’t have write permission.