Error map

attempted to access privacy-sensitive data without a usage description This app has crashed because it attempted to access privacy-sensitive data without a usage description

iOS · layer 1, On your device

Open the full error page →

Centre: this error. First ring: errors it is linked with (12). Outer ring: what those are linked with. Colours show the layer of a request each error belongs to. Click any dot to re-centre the map on it; hover to follow its connections. The centre dot opens the error page.

attempted to access privacy-sensitive data without a usage description — This app has crashed because it attempted to access privacy-sensitive data without a usage description (iOS)attempted t…SIGABRT — Thread 1: signal SIGABRT (app crashes with "libc++abi: terminating") (iOS)SIGABRTOperation not permitted (macOS privacy) — macOS: Operation not permitted — Terminal/app lacks Full Disk Access (TCC privacy protection) (macOS)Operation not permi…double free or corruption — C/C++: free(): double free detected / double free or corruption (out) — Aborted (core dumped) (C/C++)double free or corr…dyld: Library not loaded — dyld: Library not loaded: @rpath/X.framework/X — Reason: image not found (crash on launch) (iOS)dyld: Library not l…terminate called after throwing an instance of — C++: terminate called after throwing an instance of 'std::out_of_range' — what(): vector::_M_range_check (C/C++)terminate called af…ITMS-91053 — ITMS-91053: Missing API declaration — Your app's code references required reason APIs (privacy manifest) (iOS)ITMS-91053ITMS-90683 — ITMS-90683: Missing purpose string in Info.plist (NSCameraUsageDescription etc.) (iOS)ITMS-90683not allowed to query for scheme — -canOpenURL: failed for URL: "x://" - error: "This app is not allowed to query for scheme x" (iOS)not allowed to quer…Stack overflow — .NET: Stack overflow. / Process is terminated due to StackOverflowException (.NET)Stack overflowEXC_BAD_ACCESS — Thread 1: EXC_BAD_ACCESS (code=1, address=0x0) (iOS)EXC_BAD_ACCESSIndex out of range — Swift: Fatal error: Index out of range (iOS)Index out of rangeCould not cast value of type — Swift: Could not cast value of type 'X' to 'Y' (iOS)Could not cast valu…Unexpectedly found nil — Fatal error: Unexpectedly found nil while unwrapping an Optional value (iOS)Unexpectedly found …IllegalArgumentException — java.lang.IllegalArgumentException (Java)IllegalArgumentExce…ArithmeticException — java.lang.ArithmeticException: / by zero (Java)ArithmeticExceptionEACCES — npm ERR! code EACCES — permission denied (npm)EACCESdaemon — Cannot connect to the Docker daemon at unix:///var/run/docker.sock. Is the docker daemon running? (Docker)daemonEACCES — Linux: Permission denied (Linux)EACCESOOMKilled — Kubernetes: OOMKilled (exit code 137) (Kubernetes)OOMKilledOutOfMemoryError — java.lang.OutOfMemoryError: Java heap space (Java)OutOfMemoryErrorMEMORY_MANAGEMENT — Blue Screen: MEMORY_MANAGEMENT (Stop code 0x0000001A) (Windows)MEMORY_MANAGEMENTerror while loading shared libraries — error while loading shared libraries: libX.so.N: cannot open shared object file: No such file or directory (Linux)error while loading…0xC0000142 — The application was unable to start correctly (0xc0000142) (Windows)0xC0000142Undefined symbols for architecture — Undefined symbol(s) for architecture arm64 — linker command failed with exit code 1 (iOS)Undefined symbols f…SIGSEGV — Segmentation fault (core dumped) (Linux)SIGSEGVIllegalStateException — java.lang.IllegalStateException (Java)IllegalStateExcepti…NoSuchElementException — java.util.NoSuchElementException: No value present (Java)NoSuchElementExcept…ITMS-90725 — ITMS-90725: SDK version issue — This app was built with the iOS 17.x SDK. All iOS apps submitted to the App Store must be built with the iOS 18 SDK or later (iOS)ITMS-90725Redundant Binary Upload — ITMS-4238: Redundant Binary Upload. You've already uploaded a build with build number 'x' for version number 'y' (iOS)Redundant Binary Up…ITMS-90206 — ITMS-90206: Invalid Bundle. The bundle at 'App.appex' contains disallowed file 'Frameworks' (iOS)ITMS-90206ITMS-90717 — ITMS-90717: Invalid App Store Icon. The App Store Icon in the asset catalog can't be transparent nor contain an alpha channel (iOS)ITMS-90717ATS — App Transport Security has blocked a cleartext HTTP resource load (iOS)ATSbuilt for iOS, linking for simulator — Building for iOS Simulator, but linking in object file built for iOS, for architecture arm64 (iOS)built for iOS, link…CDN: trunk URL couldn't be downloaded — [!] CDN: trunk URL couldn't be downloaded: https://cdn.cocoapods.org/... (iOS)CDN: trunk URL coul…RangeError — RangeError: Maximum call stack size exceeded (JavaScript)RangeErrorStackOverflowError — java.lang.StackOverflowError (Java)StackOverflowErrorMaximum function nesting — Fatal error: Maximum function nesting level of '256' reached, aborting! (PHP)Maximum function ne…OOM killer — Killed / Out of memory: Killed process (Linux OOM killer) (Linux)OOM killerheap out of memory — FATAL ERROR: Reached heap limit Allocation failed - JavaScript heap out of memory (Node.js)heap out of memoryinvalid string length — RangeError: Invalid string length (JavaScript)invalid string leng…Index was out of range — ArgumentOutOfRangeException: Index was out of range. Must be non-negative and less than the size of the collection (.NET)Index was out of ra…is only available in iOS x or newer — Swift: 'X' is only available in iOS 16.0 or newer (iOS)is only available i…Cannot convert value of type — Swift: Cannot convert value of type 'X' to expected argument type 'Y' (iOS)Cannot convert valu…Illegal instruction — Illegal instruction (core dumped) (SIGILL) (Linux)Illegal instructionUnable to cast object of type — System.InvalidCastException: Unable to cast object of type 'X' to type 'Y' (.NET)Unable to cast obje…unable to dequeue a cell with identifier — unable to dequeue a cell with identifier Cell - must register a nib or a class for the identifier or connect a prototype cell in a storyboard (iOS)unable to dequeue a…

Directly related (12)

SIGABRTiOS

Thread 1: signal SIGABRT (app crashes with "libc++abi: terminating")

The app deliberately aborted — an uncaught exception, failed assertion or fatalError. The console above the crash has the real me…

Operation not permitted (macOS privacy)macOS

macOS: Operation not permitted — Terminal/app lacks Full Disk Access (TCC privacy protection)

macOS privacy protection (TCC) blocked access to protected folders (Desktop, Documents, Downloads, Mail, Photos, external volumes…

double free or corruptionC/C++

C/C++: free(): double free detected / double free or corruption (out) — Aborted (core dumped)

Memory was freed twice or the heap was corrupted (buffer overflow, freeing a non-heap pointer), so glibc aborted the program.

dyld: Library not loadediOS

dyld: Library not loaded: @rpath/X.framework/X — Reason: image not found (crash on launch)

A dynamic framework the app needs at runtime isn’t embedded in the app bundle, so it crashes at launch.

terminate called after throwing an instance ofC/C++

C++: terminate called after throwing an instance of 'std::out_of_range' — what(): vector::_M_range_check

A C++ exception wasn’t caught anywhere, so std::terminate aborted the program. what() tells you the reason.

ITMS-91053iOS

ITMS-91053: Missing API declaration — Your app's code references required reason APIs (privacy manifest)

The app (or an SDK in it) uses “required reason” APIs like UserDefaults, file timestamps or disk space without declaring reasons…

ITMS-90683iOS

ITMS-90683: Missing purpose string in Info.plist (NSCameraUsageDescription etc.)

The binary references a privacy-sensitive API, but Info.plist lacks the matching usage description.

not allowed to query for schemeiOS

-canOpenURL: failed for URL: "x://" - error: "This app is not allowed to query for scheme x"

The app called canOpenURL for a scheme not listed in LSApplicationQueriesSchemes in Info.plist.

Stack overflow.NET

.NET: Stack overflow. / Process is terminated due to StackOverflowException

Infinite or very deep recursion exhausted the thread’s stack; .NET can’t catch it and terminates the process.

EXC_BAD_ACCESSiOS

Thread 1: EXC_BAD_ACCESS (code=1, address=0x0)

The app accessed memory it shouldn’t — a dangling pointer, released object, unsafe pointer misuse, a data race, or infinite recur…

Index out of rangeiOS

Swift: Fatal error: Index out of range

Code accessed an array index that doesn’t exist — empty arrays, off-by-one loops, or data changing while a table reloads.

Could not cast value of typeiOS

Swift: Could not cast value of type 'X' to 'Y'

A force cast (as!) failed because the object isn’t the expected type.

Two steps away (34)

Unexpectedly found niliOS

Fatal error: Unexpectedly found nil while unwrapping an Optional value

Swift force-unwrapped (`!`) an optional that was nil, crashing the app.

IllegalArgumentExceptionJava

java.lang.IllegalArgumentException

A method rejected an argument value as invalid.

ArithmeticExceptionJava

java.lang.ArithmeticException: / by zero

Integer division or modulo by zero.

EACCESnpm

npm ERR! code EACCES — permission denied

npm can’t write to a directory — usually global installs into a root-owned folder.

daemonDocker

Cannot connect to the Docker daemon at unix:///var/run/docker.sock. Is the docker daemon running?

The docker CLI can’t talk to the Docker engine — it isn’t running, or your user can’t access the socket.

EACCESLinux

Linux: Permission denied

Your user (or the service user) lacks read/write/execute permission on a file, directory or one of its parents.

OOMKilledKubernetes

Kubernetes: OOMKilled (exit code 137)

The container used more memory than its limit, and the kernel killed it.

OutOfMemoryErrorJava

java.lang.OutOfMemoryError: Java heap space

The JVM ran out of heap memory and garbage collection couldn’t free enough.

MEMORY_MANAGEMENTWindows

Blue Screen: MEMORY_MANAGEMENT (Stop code 0x0000001A)

Windows detected a severe memory-management error — commonly faulty RAM, unstable memory settings or a bad driver.

error while loading shared librariesLinux

error while loading shared libraries: libX.so.N: cannot open shared object file: No such file or directory

The program needs a shared library (.so) that isn’t installed or isn’t on the loader’s search path.

0xC0000142Windows

The application was unable to start correctly (0xc0000142)

A DLL the program loads failed to initialise — often after an update, with corrupt runtimes, or when a desktop heap/session limit…

Undefined symbols for architectureiOS

Undefined symbol(s) for architecture arm64 — linker command failed with exit code 1

The linker can’t find the implementation of a symbol your code uses — a missing framework/library, a file not in the target, or a…

SIGSEGVLinux

Segmentation fault (core dumped)

A program accessed memory it wasn’t allowed to, and the kernel killed it with SIGSEGV (exit code 139).

IllegalStateExceptionJava

java.lang.IllegalStateException

A method was called when the object wasn’t in the right state for it.

NoSuchElementExceptionJava

java.util.NoSuchElementException: No value present

Code asked for an element that doesn’t exist — Optional.get() on empty, iterator.next() past the end, Scanner with no input.

ITMS-90725iOS

ITMS-90725: SDK version issue — This app was built with the iOS 17.x SDK. All iOS apps submitted to the App Store must be built with the iOS 18 SDK or later

App Store Connect requires uploads to be built with a recent Xcode/iOS SDK (raised every spring).

Redundant Binary UploadiOS

ITMS-4238: Redundant Binary Upload. You've already uploaded a build with build number 'x' for version number 'y'

The build number (CFBundleVersion) has already been used for that version in App Store Connect.

ITMS-90206iOS

ITMS-90206: Invalid Bundle. The bundle at 'App.appex' contains disallowed file 'Frameworks'

An app extension (or framework) embeds its own Frameworks folder; only the main app may embed frameworks.

ITMS-90717iOS

ITMS-90717: Invalid App Store Icon. The App Store Icon in the asset catalog can't be transparent nor contain an alpha channel

The 1024×1024 App Store icon has an alpha channel/transparency, which App Store Connect rejects.

ATSiOS

App Transport Security has blocked a cleartext HTTP resource load

iOS blocked an `http://` request (or a weak-TLS HTTPS one) because App Transport Security requires secure connections.

built for iOS, linking for simulatoriOS

Building for iOS Simulator, but linking in object file built for iOS, for architecture arm64

A library contains device-only arm64 code; Apple Silicon simulators also run arm64 and need a separate simulator slice.

CDN: trunk URL couldn't be downloadediOS

[!] CDN: trunk URL couldn't be downloaded: https://cdn.cocoapods.org/...

CocoaPods couldn’t reach its CDN spec repo — network/proxy issues, rate limiting, or an outdated CocoaPods.

RangeErrorJavaScript

RangeError: Maximum call stack size exceeded

A function called itself (directly or indirectly) too many times — usually infinite recursion.

StackOverflowErrorJava

java.lang.StackOverflowError

The thread’s call stack overflowed — almost always unbounded recursion, sometimes a bidirectional toString/equals/JSON cycle.

Maximum function nestingPHP

Fatal error: Maximum function nesting level of '256' reached, aborting!

Recursion went deeper than Xdebug’s max_nesting_level allows (or PHP crashed with a segfault without Xdebug).

OOM killerLinux

Killed / Out of memory: Killed process (Linux OOM killer)

The kernel ran out of memory and killed a process to recover — the program just prints “Killed” (exit code 137).

heap out of memoryNode.js

FATAL ERROR: Reached heap limit Allocation failed - JavaScript heap out of memory

The V8 heap hit its limit — a large build (webpack, tsc, Next.js) needs more memory, or the app leaks.

invalid string lengthJavaScript

RangeError: Invalid string length

A string grew beyond the engine’s maximum length — usually runaway concatenation or huge JSON.stringify output.

Index was out of range.NET

ArgumentOutOfRangeException: Index was out of range. Must be non-negative and less than the size of the collection

Code accessed a List/collection position that doesn’t exist (IndexOutOfRangeException for arrays).

is only available in iOS x or neweriOS

Swift: 'X' is only available in iOS 16.0 or newer

You used an API that requires a newer iOS than your deployment target.

Cannot convert value of typeiOS

Swift: Cannot convert value of type 'X' to expected argument type 'Y'

The value’s type doesn’t match what the function or property expects.

Illegal instructionLinux

Illegal instruction (core dumped) (SIGILL)

The program used a CPU instruction your processor doesn’t support — typically AVX/AVX2 in prebuilt binaries (TensorFlow, MongoDB…

Unable to cast object of type.NET

System.InvalidCastException: Unable to cast object of type 'X' to type 'Y'

An explicit cast failed because the object’s runtime type isn’t the target type.

unable to dequeue a cell with identifieriOS

unable to dequeue a cell with identifier Cell - must register a nib or a class for the identifier or connect a prototype cell in a storyboard

The table/collection view was asked for a reusable cell identifier that was never registered.