Error map

ITMS-90206 ITMS-90206: Invalid Bundle. The bundle at 'App.appex' contains disallowed file 'Frameworks'

iOS · layer 1, On your device

Open the full error page →

Centre: this error. First ring: errors it is linked with (12). Outer ring: what those are linked with. Colours show the layer of a request each error belongs to. Click any dot to re-centre the map on it; hover to follow its connections. The centre dot opens the error page.

ITMS-90206 — ITMS-90206: Invalid Bundle. The bundle at 'App.appex' contains disallowed file 'Frameworks' (iOS)ITMS-90206Call to undefined function — PHP Fatal error: Uncaught Error: Call to undefined function (PHP)Call to undefined f…intl missing — Class "NumberFormatter" not found / The "intl" PHP extension is required (PHP)intl missingcould not find driver — PDOException: could not find driver (PHP)could not find driv…GD missing — Fatal error: Uncaught Error: Call to undefined function imagecreatefromjpeg() (PHP)GD missingcreate extension denied — ERROR: permission denied to create extension "x" — Must be superuser to create this extension. (PostgreSQL)create extension de…dyld: Library not loaded — dyld: Library not loaded: @rpath/X.framework/X — Reason: image not found (crash on launch) (iOS)dyld: Library not l…ITMS-90725 — ITMS-90725: SDK version issue — This app was built with the iOS 17.x SDK. All iOS apps submitted to the App Store must be built with the iOS 18 SDK or later (iOS)ITMS-90725ITMS-91053 — ITMS-91053: Missing API declaration — Your app's code references required reason APIs (privacy manifest) (iOS)ITMS-91053ITMS-90683 — ITMS-90683: Missing purpose string in Info.plist (NSCameraUsageDescription etc.) (iOS)ITMS-90683ITMS-90717 — ITMS-90717: Invalid App Store Icon. The App Store Icon in the asset catalog can't be transparent nor contain an alpha channel (iOS)ITMS-9071742883 function — ERROR: function x(text) does not exist — No function matches the given name and argument types (PostgreSQL)42883 functionextension not available — ERROR: could not open extension control file ".../postgis.control": No such file or directory (PostgreSQL)extension not avail…500 — HTTP 500 Internal Server Error (HTTP)500Class not found — PHP Fatal error: Uncaught Error: Class "X" not found (PHP)Class not foundHeaders already sent — Warning: Cannot modify header information - headers already sent (PHP)Headers already sent1040 — MySQL ERROR 1040 (08004): Too many connections (MySQL)1040Communications link failure — com.mysql.cj.jdbc.exceptions.CommunicationsException: Communications link failure (Java)Communications link…HikariCP timeout — HikariPool-1 - Connection is not available, request timed out after 30000ms (Java)HikariCP timeoutImagePullBackOff — Kubernetes: ImagePullBackOff / ErrImagePull (Kubernetes)ImagePullBackOffexec format error — exec /usr/local/bin/docker-entrypoint.sh: exec format error (Docker)exec format errorconflict: unable to remove repository reference — conflict: unable to remove repository reference (must force) - container is using its referenced image (Docker)conflict: unable to…1045 — MySQL ERROR 1045 (28000): Access denied for user (MySQL)10451044 — MySQL ERROR 1044 (42000): Access denied for user to database (MySQL)104442501 — PostgreSQL: ERROR: permission denied for table / schema public (PostgreSQL)42501Unexpectedly found nil — Fatal error: Unexpectedly found nil while unwrapping an Optional value (iOS)Unexpectedly found …error while loading shared libraries — error while loading shared libraries: libX.so.N: cannot open shared object file: No such file or directory (Linux)error while loading…0xC0000142 — The application was unable to start correctly (0xc0000142) (Windows)0xC0000142Signing requires a development team — Signing for "App" requires a development team. Select a development team in the Signing & Capabilities editor (iOS)Signing requires a …No such module — Swift: No such module 'X' (module not found) (iOS)No such moduleUndefined symbols for architecture — Undefined symbol(s) for architecture arm64 — linker command failed with exit code 1 (iOS)Undefined symbols f…attempted to access privacy-sensitive data without a usage description — This app has crashed because it attempted to access privacy-sensitive data without a usage description (iOS)attempted to access…Redundant Binary Upload — ITMS-4238: Redundant Binary Upload. You've already uploaded a build with build number 'x' for version number 'y' (iOS)Redundant Binary Up…Operation not permitted (macOS privacy) — macOS: Operation not permitted — Terminal/app lacks Full Disk Access (TCC privacy protection) (macOS)Operation not permi…not allowed to query for scheme — -canOpenURL: failed for URL: "x://" - error: "This app is not allowed to query for scheme x" (iOS)not allowed to quer…ATS — App Transport Security has blocked a cleartext HTTP resource load (iOS)ATSintegrity could not be verified — Unable to Install "App": This app cannot be installed because its integrity could not be verified (iOS)integrity could not…ArgumentCountError — Fatal error: Uncaught ArgumentCountError: Too few arguments to function foo(), 1 passed and exactly 2 expected (PHP)ArgumentCountErrorTypeError arguments — TypeError: f() takes 1 positional argument but 2 were given (Python)TypeError argumentsTypeError missing arg — TypeError: f() missing 1 required positional argument: 'x' (Python)TypeError missing a…

Directly related (12)

Call to undefined functionPHP

PHP Fatal error: Uncaught Error: Call to undefined function

PHP can’t find the function you called — usually a missing extension, missing include, or namespace issue.

intl missingPHP

Class "NumberFormatter" not found / The "intl" PHP extension is required

Code uses the intl extension (NumberFormatter, Collator, IntlDateFormatter) but it isn’t installed.

could not find driverPHP

PDOException: could not find driver

The PDO driver for your database (pdo_mysql, pdo_pgsql, pdo_sqlite) isn’t installed or enabled.

GD missingPHP

Fatal error: Uncaught Error: Call to undefined function imagecreatefromjpeg()

The GD extension (or its JPEG/WebP support) isn’t installed for the PHP version serving the site.

create extension deniedPostgreSQL

ERROR: permission denied to create extension "x" — Must be superuser to create this extension.

Your role lacks the privilege to create that extension.

dyld: Library not loadediOS

dyld: Library not loaded: @rpath/X.framework/X — Reason: image not found (crash on launch)

A dynamic framework the app needs at runtime isn’t embedded in the app bundle, so it crashes at launch.

ITMS-90725iOS

ITMS-90725: SDK version issue — This app was built with the iOS 17.x SDK. All iOS apps submitted to the App Store must be built with the iOS 18 SDK or later

App Store Connect requires uploads to be built with a recent Xcode/iOS SDK (raised every spring).

ITMS-91053iOS

ITMS-91053: Missing API declaration — Your app's code references required reason APIs (privacy manifest)

The app (or an SDK in it) uses “required reason” APIs like UserDefaults, file timestamps or disk space without declaring reasons…

ITMS-90683iOS

ITMS-90683: Missing purpose string in Info.plist (NSCameraUsageDescription etc.)

The binary references a privacy-sensitive API, but Info.plist lacks the matching usage description.

ITMS-90717iOS

ITMS-90717: Invalid App Store Icon. The App Store Icon in the asset catalog can't be transparent nor contain an alpha channel

The 1024×1024 App Store icon has an alpha channel/transparency, which App Store Connect rejects.

42883 functionPostgreSQL

ERROR: function x(text) does not exist — No function matches the given name and argument types

PostgreSQL found no function with that name and argument types — wrong types, missing extension, or schema not in search_path.

extension not availablePostgreSQL

ERROR: could not open extension control file ".../postgis.control": No such file or directory

CREATE EXTENSION failed because the extension’s files aren’t installed on the server.

Two steps away (27)

500HTTP

HTTP 500 Internal Server Error

The server hit an unexpected condition — usually an unhandled exception or misconfiguration in the application.

Class not foundPHP

PHP Fatal error: Uncaught Error: Class "X" not found

PHP couldn’t load the class — autoloading failed, the namespace is wrong, or the dependency isn’t installed.

Headers already sentPHP

Warning: Cannot modify header information - headers already sent

You called `header()`, `setcookie()` or `session_start()` after output had already been sent to the browser.

1040MySQL

MySQL ERROR 1040 (08004): Too many connections

MySQL reached `max_connections` and refuses new clients.

Communications link failureJava

com.mysql.cj.jdbc.exceptions.CommunicationsException: Communications link failure

The MySQL JDBC driver couldn’t reach the database (or the connection dropped).

HikariCP timeoutJava

HikariPool-1 - Connection is not available, request timed out after 30000ms

The connection pool was exhausted — all connections were busy for 30 seconds.

ImagePullBackOffKubernetes

Kubernetes: ImagePullBackOff / ErrImagePull

The node can’t pull the container image — wrong name/tag, missing registry credentials, or registry unreachable.

exec format errorDocker

exec /usr/local/bin/docker-entrypoint.sh: exec format error

The container tried to run a binary built for a different CPU architecture (arm64 vs amd64) — or a script with a broken shebang /…

conflict: unable to remove repository referenceDocker

conflict: unable to remove repository reference (must force) - container is using its referenced image

You tried to delete an image that a container — even a stopped one — still uses.

1045MySQL

MySQL ERROR 1045 (28000): Access denied for user

MySQL rejected the login — wrong password, wrong user/host combination, or the user doesn’t exist.

1044MySQL

MySQL ERROR 1044 (42000): Access denied for user to database

The login succeeded, but the user has no privileges on the database you’re using.

42501PostgreSQL

PostgreSQL: ERROR: permission denied for table / schema public

The role is connected but lacks privileges on that table or schema — very common after PostgreSQL 15 removed CREATE on the public…

Unexpectedly found niliOS

Fatal error: Unexpectedly found nil while unwrapping an Optional value

Swift force-unwrapped (`!`) an optional that was nil, crashing the app.

error while loading shared librariesLinux

error while loading shared libraries: libX.so.N: cannot open shared object file: No such file or directory

The program needs a shared library (.so) that isn’t installed or isn’t on the loader’s search path.

0xC0000142Windows

The application was unable to start correctly (0xc0000142)

A DLL the program loads failed to initialise — often after an update, with corrupt runtimes, or when a desktop heap/session limit…

Signing requires a development teamiOS

Signing for "App" requires a development team. Select a development team in the Signing & Capabilities editor

No Apple developer team is selected for the target, so Xcode can’t sign the app.

No such moduleiOS

Swift: No such module 'X' (module not found)

Xcode can’t find a Swift package, pod or framework you import.

Undefined symbols for architectureiOS

Undefined symbol(s) for architecture arm64 — linker command failed with exit code 1

The linker can’t find the implementation of a symbol your code uses — a missing framework/library, a file not in the target, or a…

attempted to access privacy-sensitive data without a usage descriptioniOS

This app has crashed because it attempted to access privacy-sensitive data without a usage description

The app requested camera, photos, microphone, location, contacts, etc. without the required NS…UsageDescription in Info.plist, so…

Redundant Binary UploadiOS

ITMS-4238: Redundant Binary Upload. You've already uploaded a build with build number 'x' for version number 'y'

The build number (CFBundleVersion) has already been used for that version in App Store Connect.

Operation not permitted (macOS privacy)macOS

macOS: Operation not permitted — Terminal/app lacks Full Disk Access (TCC privacy protection)

macOS privacy protection (TCC) blocked access to protected folders (Desktop, Documents, Downloads, Mail, Photos, external volumes…

not allowed to query for schemeiOS

-canOpenURL: failed for URL: "x://" - error: "This app is not allowed to query for scheme x"

The app called canOpenURL for a scheme not listed in LSApplicationQueriesSchemes in Info.plist.

ATSiOS

App Transport Security has blocked a cleartext HTTP resource load

iOS blocked an `http://` request (or a weak-TLS HTTPS one) because App Transport Security requires secure connections.

integrity could not be verifiediOS

Unable to Install "App": This app cannot be installed because its integrity could not be verified

iOS rejected the app because its signature doesn’t validate for this device — expired/revoked certificate, ad-hoc profile without…

ArgumentCountErrorPHP

Fatal error: Uncaught ArgumentCountError: Too few arguments to function foo(), 1 passed and exactly 2 expected

A function was called with fewer arguments than it requires.

TypeError argumentsPython

TypeError: f() takes 1 positional argument but 2 were given

A function was called with more positional arguments than it accepts — very often a method missing `self`.

TypeError missing argPython

TypeError: f() missing 1 required positional argument: 'x'

A function was called without a required parameter.