Error map

conflict: unable to remove repository reference conflict: unable to remove repository reference (must force) - container is using its referenced image

Docker · layer 6, Platform & cloud

Open the full error page →

Centre: this error. First ring: errors it is linked with (12). Outer ring: what those are linked with. Colours show the layer of a request each error belongs to. Click any dot to re-centre the map on it; hover to follow its connections. The centre dot opens the error page.

conflict: unable to remove repository reference — conflict: unable to remove repository reference (must force) - container is using its referenced image (Docker)conflict: u…next/image hostname — Error: Invalid src prop on `next/image`, hostname "x" is not configured under images in your `next.config.js` (React)next/image hostname1011 — Cloudflare Error 1011: Access denied (Hotlinking denied) (Cloudflare)1011GD missing — Fatal error: Uncaught Error: Call to undefined function imagecreatefromjpeg() (PHP)GD missingOSProvisioningTimedOut — Azure VM: OSProvisioningTimedOut — OS Provisioning for VM did not finish in the allotted time (Azure)OSProvisioningTimed…ENOSPC — no space left on device (Docker / Linux) (Docker)ENOSPCmanifest unknown — manifest for image:tag not found: manifest unknown (Docker)manifest unknownexec format error — exec /usr/local/bin/docker-entrypoint.sh: exec format error (Docker)exec format errorimage has dependent child images — conflict: unable to delete image (cannot be forced) - image has dependent child images (Docker)image has dependent…invalid reference format — docker: invalid reference format (repository name must be lowercase) (Docker)invalid reference f…no matching manifest — no matching manifest for linux/arm64/v8 in the manifest list entries (Docker)no matching manifestSystem.Drawing.Common is not supported — PlatformNotSupportedException: System.Drawing.Common is not supported on this platform (.NET)System.Drawing.Comm…max depth exceeded — Error response from daemon: max depth exceeded (too many image layers) (Docker)max depth exceededImagePullBackOff — Kubernetes: ImagePullBackOff / ErrImagePull (Kubernetes)ImagePullBackOffHydration failed — Error: Hydration failed because the initial UI does not match what was rendered on the server (React)Hydration failedCan't resolve 'fs' — Module not found: Can't resolve 'fs' (Next.js / webpack 5) (React)Can't resolve 'fs'403 — HTTP 403 Forbidden (HTTP)4031020 — Cloudflare Error 1020: Access Denied (Cloudflare)1020InvalidImageName — Pod status InvalidImageName: couldn't parse image reference (Kubernetes)InvalidImageNameCall to undefined function — PHP Fatal error: Uncaught Error: Call to undefined function (PHP)Call to undefined f…could not find driver — PDOException: could not find driver (PHP)could not find driv…intl missing — Class "NumberFormatter" not found / The "intl" PHP extension is required (PHP)intl missingInstance reachability check failed — EC2 status check failed: Instance reachability check failed (1/2 checks passed) (AWS)Instance reachabili…AllocationFailed — Azure VM: AllocationFailed / ZonalAllocationFailed — Allocation failed. We do not have sufficient capacity for the requested VM size (Azure)AllocationFailedENOENT — Error: ENOENT: no such file or directory (Node.js)ENOENTEvicted — Kubernetes: Pod Evicted — The node was low on resource: memory / ephemeral-storage (Kubernetes)Evicted1114 — MySQL ERROR 1114 (HY000): The table 'x' is full (MySQL)1114pull access denied — pull access denied for image, repository does not exist or may require 'docker login' (Docker)pull access deniedtoomanyrequests — toomanyrequests: You have reached your pull rate limit (Docker Hub) (Docker)toomanyrequestsunauthorized: authentication required — unauthorized: authentication required (docker push / pull) (Docker)unauthorized: authe…CrashLoopBackOff — Kubernetes: CrashLoopBackOff (Kubernetes)CrashLoopBackOffcommand not found — bash: command not found (Linux)command not foundCOPY failed — COPY failed: file not found in build context / "/app/x": not found (Docker)COPY failedis not running — Error response from daemon: Container X is not running (Docker)is not runningdocker-compose: command not found — docker-compose: command not found / 'compose' is not a docker command (Docker)docker-compose: com…the input device is not a TTY — the input device is not a TTY (Docker)the input device is…cannot execute binary file — cannot execute binary file: Exec format error (Linux)cannot execute bina…Illegal instruction — Illegal instruction (core dumped) (SIGILL) (Linux)Illegal instructionINSTALL_FAILED_NO_MATCHING_ABIS — INSTALL_FAILED_NO_MATCHING_ABIS: Failed to extract native libraries (Android)INSTALL_FAILED_NO_M…FileNotFoundException assembly — Could not load file or assembly 'X, Version=…' or one of its dependencies (.NET)FileNotFoundExcepti…You must install or update .NET to run this application — The framework 'Microsoft.NETCore.App', version '8.0.0' (x64) was not found. You must install or update .NET to run this application (.NET)You must install or…did not complete successfully — failed to solve: process "/bin/sh -c ..." did not complete successfully: exit code: 1 (Docker)did not complete su…failed to read dockerfile — failed to solve: failed to read dockerfile: open Dockerfile: no such file or directory (Docker)failed to read dock…unknown instruction — Dockerfile parse error line N: unknown instruction (Docker)unknown instruction

Directly related (12)

next/image hostnameReact

Error: Invalid src prop on `next/image`, hostname "x" is not configured under images in your `next.config.js`

next/image refuses to optimize images from domains not allowed in next.config.js.

1011Cloudflare

Cloudflare Error 1011: Access denied (Hotlinking denied)

An image or file is being loaded from another site, and Cloudflare Hotlink Protection blocked it.

GD missingPHP

Fatal error: Uncaught Error: Call to undefined function imagecreatefromjpeg()

The GD extension (or its JPEG/WebP support) isn’t installed for the PHP version serving the site.

OSProvisioningTimedOutAzure

Azure VM: OSProvisioningTimedOut — OS Provisioning for VM did not finish in the allotted time

The VM booted but its guest agent didn’t report provisioning success in time — usually a generalisation problem with a custom ima…

ENOSPCDocker

no space left on device (Docker / Linux)

The disk (or inode table) is full — Docker images, build cache, logs and volumes are common culprits.

manifest unknownDocker

manifest for image:tag not found: manifest unknown

The repository exists, but the tag you asked for doesn’t — it was never pushed, was deleted, or is misspelled.

exec format errorDocker

exec /usr/local/bin/docker-entrypoint.sh: exec format error

The container tried to run a binary built for a different CPU architecture (arm64 vs amd64) — or a script with a broken shebang /…

image has dependent child imagesDocker

conflict: unable to delete image (cannot be forced) - image has dependent child images

Other images were built on top of this one, so Docker won’t delete it by ID.

invalid reference formatDocker

docker: invalid reference format (repository name must be lowercase)

Docker couldn’t parse the image name — uppercase letters, spaces, an empty variable, or a misplaced option.

no matching manifestDocker

no matching manifest for linux/arm64/v8 in the manifest list entries

The image has no build for your CPU architecture — typically pulling an amd64-only image on an Apple Silicon Mac or ARM server.

System.Drawing.Common is not supported.NET

PlatformNotSupportedException: System.Drawing.Common is not supported on this platform

Since .NET 6, System.Drawing.Common only works on Windows; on Linux/macOS (including Docker) it throws.

max depth exceededDocker

Error response from daemon: max depth exceeded (too many image layers)

The image has more layers than the storage driver allows (127 for overlay2), usually from repeatedly committing containers or ver…

Two steps away (31)

ImagePullBackOffKubernetes

Kubernetes: ImagePullBackOff / ErrImagePull

The node can’t pull the container image — wrong name/tag, missing registry credentials, or registry unreachable.

Hydration failedReact

Error: Hydration failed because the initial UI does not match what was rendered on the server

The HTML rendered on the server differs from the first client render, so React (Next.js/Remix) can’t attach to it.

Can't resolve 'fs'React

Module not found: Can't resolve 'fs' (Next.js / webpack 5)

A Node.js built-in (fs, path, crypto, net) is imported into code that runs in the browser bundle.

403HTTP

HTTP 403 Forbidden

The server understood the request but refuses to authorize it — you (or the server process) are not allowed to access this resour…

1020Cloudflare

Cloudflare Error 1020: Access Denied

A Cloudflare firewall/WAF custom rule blocked the request — the visitor’s IP, country, user agent or request pattern matched a bl…

InvalidImageNameKubernetes

Pod status InvalidImageName: couldn't parse image reference

The image field in the pod spec isn’t a valid image reference, so the kubelet can’t even try to pull it.

Call to undefined functionPHP

PHP Fatal error: Uncaught Error: Call to undefined function

PHP can’t find the function you called — usually a missing extension, missing include, or namespace issue.

could not find driverPHP

PDOException: could not find driver

The PDO driver for your database (pdo_mysql, pdo_pgsql, pdo_sqlite) isn’t installed or enabled.

intl missingPHP

Class "NumberFormatter" not found / The "intl" PHP extension is required

Code uses the intl extension (NumberFormatter, Collator, IntlDateFormatter) but it isn’t installed.

Instance reachability check failedAWS

EC2 status check failed: Instance reachability check failed (1/2 checks passed)

AWS can reach the host, but the operating system inside the instance isn’t responding — kernel panic, full disk, broken network c…

AllocationFailedAzure

Azure VM: AllocationFailed / ZonalAllocationFailed — Allocation failed. We do not have sufficient capacity for the requested VM size

Azure has no capacity for that VM size in the region/zone (or in the cluster the VM is pinned to) right now.

ENOENTNode.js

Error: ENOENT: no such file or directory

A file or directory the program tried to open doesn’t exist at that path.

EvictedKubernetes

Kubernetes: Pod Evicted — The node was low on resource: memory / ephemeral-storage

The kubelet removed the pod because its node ran short of memory or disk.

1114MySQL

MySQL ERROR 1114 (HY000): The table 'x' is full

MySQL couldn’t extend the table — disk full, a size limit, or a MEMORY table hitting max_heap_table_size.

pull access deniedDocker

pull access denied for image, repository does not exist or may require 'docker login'

Docker couldn’t pull the image: the name or tag is wrong, the repository is private and you’re not logged in, or it doesn’t exist…

toomanyrequestsDocker

toomanyrequests: You have reached your pull rate limit (Docker Hub)

Docker Hub limits anonymous and free pulls; your IP or account has used its quota for the current window.

unauthorized: authentication requiredDocker

unauthorized: authentication required (docker push / pull)

The registry needs credentials for this operation and the request had none or had expired ones.

CrashLoopBackOffKubernetes

Kubernetes: CrashLoopBackOff

The container starts, crashes (or exits), and Kubernetes keeps restarting it with increasing back-off delays.

command not foundLinux

bash: command not found

The shell can’t find an executable with that name in any directory on your PATH.

COPY failedDocker

COPY failed: file not found in build context / "/app/x": not found

The Dockerfile COPY refers to a path outside the build context, excluded by .dockerignore, or relative to the wrong directory.

is not runningDocker

Error response from daemon: Container X is not running

You tried to exec into or interact with a container that has stopped.

docker-compose: command not foundDocker

docker-compose: command not found / 'compose' is not a docker command

Your system has only one of the two Compose flavours: the old docker-compose (v1) binary or the newer docker compose (v2) plugin.

the input device is not a TTYDocker

the input device is not a TTY

docker run/exec was called with -t (allocate a terminal) in a context with no terminal — CI, cron, a pipe or a script.

cannot execute binary fileLinux

cannot execute binary file: Exec format error

The program was built for a different CPU architecture or OS — e.g. an x86_64 binary on an ARM machine (Raspberry Pi, Graviton, A…

Illegal instructionLinux

Illegal instruction (core dumped) (SIGILL)

The program used a CPU instruction your processor doesn’t support — typically AVX/AVX2 in prebuilt binaries (TensorFlow, MongoDB…

INSTALL_FAILED_NO_MATCHING_ABISAndroid

INSTALL_FAILED_NO_MATCHING_ABIS: Failed to extract native libraries

The APK contains native (.so) libraries only for CPU architectures the device doesn’t support — e.g. x86 emulator with arm-only l…

FileNotFoundException assembly.NET

Could not load file or assembly 'X, Version=…' or one of its dependencies

The runtime couldn’t find or load a referenced DLL — missing from the output, wrong version, or wrong platform (x86/x64).

You must install or update .NET to run this application.NET

The framework 'Microsoft.NETCore.App', version '8.0.0' (x64) was not found. You must install or update .NET to run this application

The machine doesn’t have the .NET runtime version the app was built for (framework-dependent deployment).

did not complete successfullyDocker

failed to solve: process "/bin/sh -c ..." did not complete successfully: exit code: 1

A RUN step in your Dockerfile failed. The real error is printed in the lines just above this message.

failed to read dockerfileDocker

failed to solve: failed to read dockerfile: open Dockerfile: no such file or directory

docker build can’t find a Dockerfile in the build context you passed.

unknown instructionDocker

Dockerfile parse error line N: unknown instruction

A line in the Dockerfile doesn’t start with a valid instruction — usually a broken line continuation or a typo.