Error map

System.Drawing.Common is not supported PlatformNotSupportedException: System.Drawing.Common is not supported on this platform

.NET · layer 4, Application & API

Open the full error page →

Centre: this error. First ring: errors it is linked with (12). Outer ring: what those are linked with. Colours show the layer of a request each error belongs to. Click any dot to re-centre the map on it; hover to follow its connections. The centre dot opens the error page.

System.Drawing.Common is not supported — PlatformNotSupportedException: System.Drawing.Common is not supported on this platform (.NET)System.Draw…FileNotFoundException assembly — Could not load file or assembly 'X, Version=…' or one of its dependencies (.NET)FileNotFoundExcepti…next/image hostname — Error: Invalid src prop on `next/image`, hostname "x" is not configured under images in your `next.config.js` (React)next/image hostname1011 — Cloudflare Error 1011: Access denied (Hotlinking denied) (Cloudflare)1011GD missing — Fatal error: Uncaught Error: Call to undefined function imagecreatefromjpeg() (PHP)GD missingInvalidImageName — Pod status InvalidImageName: couldn't parse image reference (Kubernetes)InvalidImageNameOSProvisioningTimedOut — Azure VM: OSProvisioningTimedOut — OS Provisioning for VM did not finish in the allotted time (Azure)OSProvisioningTimed…ImagePullBackOff — Kubernetes: ImagePullBackOff / ErrImagePull (Kubernetes)ImagePullBackOffmanifest unknown — manifest for image:tag not found: manifest unknown (Docker)manifest unknownYou must install or update .NET to run this application — The framework 'Microsoft.NETCore.App', version '8.0.0' (x64) was not found. You must install or update .NET to run this application (.NET)You must install or…exec format error — exec /usr/local/bin/docker-entrypoint.sh: exec format error (Docker)exec format errorconflict: unable to remove repository reference — conflict: unable to remove repository reference (must force) - container is using its referenced image (Docker)conflict: unable to…image has dependent child images — conflict: unable to delete image (cannot be forced) - image has dependent child images (Docker)image has dependent…ClassNotFoundException — java.lang.ClassNotFoundException / NoClassDefFoundError (Java)ClassNotFoundExcept…500.30 — HTTP Error 500.30 - ASP.NET Core app failed to start (.NET)500.30MIME type not executable — Refused to execute script from 'x' because its MIME type ('text/html') is not executable (JavaScript)MIME type not execu…Hydration failed — Error: Hydration failed because the initial UI does not match what was rendered on the server (React)Hydration failedCan't resolve 'fs' — Module not found: Can't resolve 'fs' (Next.js / webpack 5) (React)Can't resolve 'fs'needs useState — You're importing a component that needs useState. It only works in a Client Component but none of its parents are marked with "use client" (React)needs useState403 — HTTP 403 Forbidden (HTTP)4031020 — Cloudflare Error 1020: Access Denied (Cloudflare)1020no matching manifest — no matching manifest for linux/arm64/v8 in the manifest list entries (Docker)no matching manifestCall to undefined function — PHP Fatal error: Uncaught Error: Call to undefined function (PHP)Call to undefined f…could not find driver — PDOException: could not find driver (PHP)could not find driv…intl missing — Class "NumberFormatter" not found / The "intl" PHP extension is required (PHP)intl missingCrashLoopBackOff — Kubernetes: CrashLoopBackOff (Kubernetes)CrashLoopBackOffinvalid reference format — docker: invalid reference format (repository name must be lowercase) (Docker)invalid reference f…CreateContainerError — Pod status CreateContainerError (Kubernetes)CreateContainerErrorInstance reachability check failed — EC2 status check failed: Instance reachability check failed (1/2 checks passed) (AWS)Instance reachabili…max depth exceeded — Error response from daemon: max depth exceeded (too many image layers) (Docker)max depth exceededAllocationFailed — Azure VM: AllocationFailed / ZonalAllocationFailed — Allocation failed. We do not have sufficient capacity for the requested VM size (Azure)AllocationFailedFailedScheduling — Kubernetes: Pod stuck in Pending — FailedScheduling: 0/3 nodes are available (Kubernetes)FailedSchedulingCannotPullContainerError — ECS task stopped: CannotPullContainerError: pull image manifest has been retried ... / ref pull has been retried (AWS)CannotPullContainer…pull access denied — pull access denied for image, repository does not exist or may require 'docker login' (Docker)pull access deniedtoomanyrequests — toomanyrequests: You have reached your pull rate limit (Docker Hub) (Docker)toomanyrequestsunauthorized: authentication required — unauthorized: authentication required (docker push / pull) (Docker)unauthorized: authe…denied — denied: requested access to the resource is denied (docker push) (Docker)deniedApp Service Application Error — Azure App Service: ":( Application Error" / container didn’t respond to HTTP pings (Azure)App Service Applica…UnsupportedClassVersionError — java.lang.UnsupportedClassVersionError: class file version 61.0, this version of the Java Runtime only recognizes up to 55.0 (Java)UnsupportedClassVer…Unexpected token < — SyntaxError: Unexpected token '<' (HTML served instead of JavaScript) (JavaScript)Unexpected token <command not found — bash: command not found (Linux)command not foundCOPY failed — COPY failed: file not found in build context / "/app/x": not found (Docker)COPY failedexec no such file or directory — exec /docker-entrypoint.sh: no such file or directory (CRLF line endings / missing interpreter) (Docker)exec no such file o…ENOSPC — no space left on device (Docker / Linux) (Docker)ENOSPC

Directly related (12)

FileNotFoundException assembly.NET

Could not load file or assembly 'X, Version=…' or one of its dependencies

The runtime couldn’t find or load a referenced DLL — missing from the output, wrong version, or wrong platform (x86/x64).

next/image hostnameReact

Error: Invalid src prop on `next/image`, hostname "x" is not configured under images in your `next.config.js`

next/image refuses to optimize images from domains not allowed in next.config.js.

1011Cloudflare

Cloudflare Error 1011: Access denied (Hotlinking denied)

An image or file is being loaded from another site, and Cloudflare Hotlink Protection blocked it.

GD missingPHP

Fatal error: Uncaught Error: Call to undefined function imagecreatefromjpeg()

The GD extension (or its JPEG/WebP support) isn’t installed for the PHP version serving the site.

InvalidImageNameKubernetes

Pod status InvalidImageName: couldn't parse image reference

The image field in the pod spec isn’t a valid image reference, so the kubelet can’t even try to pull it.

OSProvisioningTimedOutAzure

Azure VM: OSProvisioningTimedOut — OS Provisioning for VM did not finish in the allotted time

The VM booted but its guest agent didn’t report provisioning success in time — usually a generalisation problem with a custom ima…

ImagePullBackOffKubernetes

Kubernetes: ImagePullBackOff / ErrImagePull

The node can’t pull the container image — wrong name/tag, missing registry credentials, or registry unreachable.

manifest unknownDocker

manifest for image:tag not found: manifest unknown

The repository exists, but the tag you asked for doesn’t — it was never pushed, was deleted, or is misspelled.

You must install or update .NET to run this application.NET

The framework 'Microsoft.NETCore.App', version '8.0.0' (x64) was not found. You must install or update .NET to run this application

The machine doesn’t have the .NET runtime version the app was built for (framework-dependent deployment).

exec format errorDocker

exec /usr/local/bin/docker-entrypoint.sh: exec format error

The container tried to run a binary built for a different CPU architecture (arm64 vs amd64) — or a script with a broken shebang /…

conflict: unable to remove repository referenceDocker

conflict: unable to remove repository reference (must force) - container is using its referenced image

You tried to delete an image that a container — even a stopped one — still uses.

image has dependent child imagesDocker

conflict: unable to delete image (cannot be forced) - image has dependent child images

Other images were built on top of this one, so Docker won’t delete it by ID.

Two steps away (31)

ClassNotFoundExceptionJava

java.lang.ClassNotFoundException / NoClassDefFoundError

The JVM couldn’t find a class on the classpath at runtime.

500.30.NET

HTTP Error 500.30 - ASP.NET Core app failed to start

IIS/Azure’s ASP.NET Core Module launched your app but it crashed during startup.

MIME type not executableJavaScript

Refused to execute script from 'x' because its MIME type ('text/html') is not executable

The browser fetched a script but the server labelled it text/html (usually an error page), so it refused to run it.

Hydration failedReact

Error: Hydration failed because the initial UI does not match what was rendered on the server

The HTML rendered on the server differs from the first client render, so React (Next.js/Remix) can’t attach to it.

Can't resolve 'fs'React

Module not found: Can't resolve 'fs' (Next.js / webpack 5)

A Node.js built-in (fs, path, crypto, net) is imported into code that runs in the browser bundle.

needs useStateReact

You're importing a component that needs useState. It only works in a Client Component but none of its parents are marked with "use client"

In the Next.js App Router, a component using hooks or browser APIs is rendered as a Server Component.

403HTTP

HTTP 403 Forbidden

The server understood the request but refuses to authorize it — you (or the server process) are not allowed to access this resour…

1020Cloudflare

Cloudflare Error 1020: Access Denied

A Cloudflare firewall/WAF custom rule blocked the request — the visitor’s IP, country, user agent or request pattern matched a bl…

no matching manifestDocker

no matching manifest for linux/arm64/v8 in the manifest list entries

The image has no build for your CPU architecture — typically pulling an amd64-only image on an Apple Silicon Mac or ARM server.

Call to undefined functionPHP

PHP Fatal error: Uncaught Error: Call to undefined function

PHP can’t find the function you called — usually a missing extension, missing include, or namespace issue.

could not find driverPHP

PDOException: could not find driver

The PDO driver for your database (pdo_mysql, pdo_pgsql, pdo_sqlite) isn’t installed or enabled.

intl missingPHP

Class "NumberFormatter" not found / The "intl" PHP extension is required

Code uses the intl extension (NumberFormatter, Collator, IntlDateFormatter) but it isn’t installed.

CrashLoopBackOffKubernetes

Kubernetes: CrashLoopBackOff

The container starts, crashes (or exits), and Kubernetes keeps restarting it with increasing back-off delays.

invalid reference formatDocker

docker: invalid reference format (repository name must be lowercase)

Docker couldn’t parse the image name — uppercase letters, spaces, an empty variable, or a misplaced option.

CreateContainerErrorKubernetes

Pod status CreateContainerError

The image was pulled, but the container runtime failed to create the container — bad command, missing mount target, or a name/vol…

Instance reachability check failedAWS

EC2 status check failed: Instance reachability check failed (1/2 checks passed)

AWS can reach the host, but the operating system inside the instance isn’t responding — kernel panic, full disk, broken network c…

max depth exceededDocker

Error response from daemon: max depth exceeded (too many image layers)

The image has more layers than the storage driver allows (127 for overlay2), usually from repeatedly committing containers or ver…

AllocationFailedAzure

Azure VM: AllocationFailed / ZonalAllocationFailed — Allocation failed. We do not have sufficient capacity for the requested VM size

Azure has no capacity for that VM size in the region/zone (or in the cluster the VM is pinned to) right now.

FailedSchedulingKubernetes

Kubernetes: Pod stuck in Pending — FailedScheduling: 0/3 nodes are available

The scheduler can’t find a node that satisfies the pod’s resource requests, selectors, taints or volume constraints.

CannotPullContainerErrorAWS

ECS task stopped: CannotPullContainerError: pull image manifest has been retried ... / ref pull has been retried

The ECS task couldn’t pull its image — no network route to the registry, missing ECR permissions, or a wrong image tag.

pull access deniedDocker

pull access denied for image, repository does not exist or may require 'docker login'

Docker couldn’t pull the image: the name or tag is wrong, the repository is private and you’re not logged in, or it doesn’t exist…

toomanyrequestsDocker

toomanyrequests: You have reached your pull rate limit (Docker Hub)

Docker Hub limits anonymous and free pulls; your IP or account has used its quota for the current window.

unauthorized: authentication requiredDocker

unauthorized: authentication required (docker push / pull)

The registry needs credentials for this operation and the request had none or had expired ones.

deniedDocker

denied: requested access to the resource is denied (docker push)

You’re logged in, but not allowed to push to that repository — usually the image isn’t tagged with your own username/organisation.

App Service Application ErrorAzure

Azure App Service: ":( Application Error" / container didn’t respond to HTTP pings

App Service started your app but it crashed or never listened on the expected port.

UnsupportedClassVersionErrorJava

java.lang.UnsupportedClassVersionError: class file version 61.0, this version of the Java Runtime only recognizes up to 55.0

Code compiled for a newer Java version is running on an older JVM.

Unexpected token <JavaScript

SyntaxError: Unexpected token '<' (HTML served instead of JavaScript)

The browser loaded a .js file but received HTML (an error page or the SPA index.html).

command not foundLinux

bash: command not found

The shell can’t find an executable with that name in any directory on your PATH.

COPY failedDocker

COPY failed: file not found in build context / "/app/x": not found

The Dockerfile COPY refers to a path outside the build context, excluded by .dockerignore, or relative to the wrong directory.

exec no such file or directoryDocker

exec /docker-entrypoint.sh: no such file or directory (CRLF line endings / missing interpreter)

The entrypoint file exists, but the kernel can’t run it — almost always Windows CRLF line endings in the script, or a shebang poi…

ENOSPCDocker

no space left on device (Docker / Linux)

The disk (or inode table) is full — Docker images, build cache, logs and volumes are common culprits.