Error map

You must install or update .NET to run this application The framework 'Microsoft.NETCore.App', version '8.0.0' (x64) was not found. You must install or update .NET to run this application

.NET · layer 4, Application & API

Open the full error page →

Centre: this error. First ring: errors it is linked with (11). Outer ring: what those are linked with. Colours show the layer of a request each error belongs to. Click any dot to re-centre the map on it; hover to follow its connections. The centre dot opens the error page.

You must install or update .NET to run this application — The framework 'Microsoft.NETCore.App', version '8.0.0' (x64) was not found. You must install or update .NET to run this application (.NET)You must in…FileNotFoundException assembly — Could not load file or assembly 'X, Version=…' or one of its dependencies (.NET)FileNotFoundExcepti…module MIME type — Failed to load module script: Expected a JavaScript module script but the server responded with a MIME type of "text/html" (JavaScript)module MIME type500.30 — HTTP Error 500.30 - ASP.NET Core app failed to start (.NET)500.30Unexpected token < — SyntaxError: Unexpected token '<' (HTML served instead of JavaScript) (JavaScript)Unexpected token <ChunkLoadError — ChunkLoadError: Loading chunk 123 failed. (JavaScript)ChunkLoadErrorOPcache stale code — PHP still runs old code after deploy (OPcache not reset) (PHP)OPcache stale codeNETSDK1045 — error NETSDK1045: The current .NET SDK does not support targeting .NET 8.0. Either target .NET 7.0 or lower, or use a version of the .NET SDK that supports .NET 8.0 (.NET)NETSDK1045UnsupportedClassVersionError — java.lang.UnsupportedClassVersionError: class file version 61.0, this version of the Java Runtime only recognizes up to 55.0 (Java)UnsupportedClassVer…App Service Application Error — Azure App Service: ":( Application Error" / container didn’t respond to HTTP pings (Azure)App Service Applica…System.Drawing.Common is not supported — PlatformNotSupportedException: System.Drawing.Common is not supported on this platform (.NET)System.Drawing.Comm…MIME type not executable — Refused to execute script from 'x' because its MIME type ('text/html') is not executable (JavaScript)MIME type not execu…ClassNotFoundException — java.lang.ClassNotFoundException / NoClassDefFoundError (Java)ClassNotFoundExcept…NU1605 — error NU1605: Detected package downgrade: X from 8.0.1 to 8.0.0. Reference the package directly from the project to select a different version (.NET)NU16050xC000007B — The application was unable to start correctly (0xc000007b) (Windows)0xC000007BRefused to apply style from — Console: Refused to apply style from 'https://…/style.css' because its MIME type ('text/html') is not a supported stylesheet MIME type (Browser)Refused to apply st…Service worker registration failed — Console: Failed to register a ServiceWorker: A bad HTTP response code (404) was received when fetching the script (Browser)Service worker regi…Failed to find a valid digest in the 'integrity' attribute — Console: Failed to find a valid digest in the 'integrity' attribute for resource … with computed SHA-256 integrity (Browser)Failed to find a va…500 — HTTP 500 Internal Server Error (HTTP)500InvalidOperationException — InvalidOperationException: Unable to resolve service for type 'X' while attempting to activate 'Y' (.NET)InvalidOperationExc…ExceptionInInitializerError — java.lang.ExceptionInInitializerError (Java)ExceptionInInitiali…SyntaxError: JSON — SyntaxError: Unexpected token < in JSON at position 0 (JavaScript)SyntaxError: JSONmissing ) — SyntaxError: missing ) after argument list (JavaScript)missing )already declared — SyntaxError: Identifier 'x' has already been declared (JavaScript)already declaredinvalid selector — DOMException: Failed to execute 'querySelector' on 'Document': 'x' is not a valid selector (JavaScript)invalid selectorCan't resolve 'fs' — Module not found: Can't resolve 'fs' (Next.js / webpack 5) (React)Can't resolve 'fs'Module parse failed — Module parse failed: Unexpected token. You may need an appropriate loader to handle this file type (React)Module parse failedPrimary script unknown — FastCGI sent in stderr: "Primary script unknown" (PHP)Primary script unkn…ELIFECYCLE — npm ERR! code ELIFECYCLE / Command failed with exit code 1 (npm)ELIFECYCLEgyp ERR! — gyp ERR! build error / node-gyp rebuild failed (npm)gyp ERR!COPY failed — COPY failed: file not found in build context / "/app/x": not found (Docker)COPY failedUnsupported class file major version — Gradle: Unsupported class file major version / Android Gradle plugin requires Java 17 to run (Android)Unsupported class f…JAVA_HOME not set — ERROR: JAVA_HOME is not set and no 'java' command could be found in your PATH. (Java)JAVA_HOME not setrelease version not supported — [ERROR] Fatal error compiling: error: release version 17 not supported (Java)release version not…CrashLoopBackOff — Kubernetes: CrashLoopBackOff (Kubernetes)CrashLoopBackOff502 — HTTP 502 Bad Gateway (HTTP)502No job functions found — Azure Functions: No job functions found. Try making your job classes and methods public / Error indexing method (Azure)No job functions fo…ImagePullBackOff — Kubernetes: ImagePullBackOff / ErrImagePull (Kubernetes)ImagePullBackOffexec format error — exec /usr/local/bin/docker-entrypoint.sh: exec format error (Docker)exec format errorGD missing — Fatal error: Uncaught Error: Call to undefined function imagecreatefromjpeg() (PHP)GD missingDevTools failed to load source map — DevTools: Failed to load source map — Could not load content for https://…/app.js.map: HTTP error: status code 404 (Browser)DevTools failed to …

Directly related (11)

FileNotFoundException assembly.NET

Could not load file or assembly 'X, Version=…' or one of its dependencies

The runtime couldn’t find or load a referenced DLL — missing from the output, wrong version, or wrong platform (x86/x64).

module MIME typeJavaScript

Failed to load module script: Expected a JavaScript module script but the server responded with a MIME type of "text/html"

A or dynamic import got HTML back instead of JavaScript.

500.30.NET

HTTP Error 500.30 - ASP.NET Core app failed to start

IIS/Azure’s ASP.NET Core Module launched your app but it crashed during startup.

Unexpected token <JavaScript

SyntaxError: Unexpected token '<' (HTML served instead of JavaScript)

The browser loaded a .js file but received HTML (an error page or the SPA index.html).

ChunkLoadErrorJavaScript

ChunkLoadError: Loading chunk 123 failed.

A lazily loaded JavaScript chunk couldn’t be downloaded — usually because a new deployment removed the old hashed files.

OPcache stale codePHP

PHP still runs old code after deploy (OPcache not reset)

OPcache keeps serving cached bytecode, so changes uploaded to the server don’t take effect.

NETSDK1045.NET

error NETSDK1045: The current .NET SDK does not support targeting .NET 8.0. Either target .NET 7.0 or lower, or use a version of the .NET SDK that supports .NET 8.0

The installed .NET SDK is older than the project’s TargetFramework.

UnsupportedClassVersionErrorJava

java.lang.UnsupportedClassVersionError: class file version 61.0, this version of the Java Runtime only recognizes up to 55.0

Code compiled for a newer Java version is running on an older JVM.

App Service Application ErrorAzure

Azure App Service: ":( Application Error" / container didn’t respond to HTTP pings

App Service started your app but it crashed or never listened on the expected port.

System.Drawing.Common is not supported.NET

PlatformNotSupportedException: System.Drawing.Common is not supported on this platform

Since .NET 6, System.Drawing.Common only works on Windows; on Linux/macOS (including Docker) it throws.

MIME type not executableJavaScript

Refused to execute script from 'x' because its MIME type ('text/html') is not executable

The browser fetched a script but the server labelled it text/html (usually an error page), so it refused to run it.

Two steps away (29)

ClassNotFoundExceptionJava

java.lang.ClassNotFoundException / NoClassDefFoundError

The JVM couldn’t find a class on the classpath at runtime.

NU1605.NET

error NU1605: Detected package downgrade: X from 8.0.1 to 8.0.0. Reference the package directly from the project to select a different version

A direct reference requests a lower version than a dependency needs, and NuGet treats the downgrade as an error.

0xC000007BWindows

The application was unable to start correctly (0xc000007b)

A program loaded a DLL of the wrong architecture (32-bit vs 64-bit) or a corrupted runtime library.

Refused to apply style fromBrowser

Console: Refused to apply style from 'https://…/style.css' because its MIME type ('text/html') is not a supported stylesheet MIME type

The stylesheet URL returned something that is not CSS — usually a 404/HTML error page — and `X-Content-Type-Options: nosniff` mak…

Service worker registration failedBrowser

Console: Failed to register a ServiceWorker: A bad HTTP response code (404) was received when fetching the script

The browser could not fetch, parse or install the service worker script, or the page is not allowed to register one (HTTPS and sc…

Failed to find a valid digest in the 'integrity' attributeBrowser

Console: Failed to find a valid digest in the 'integrity' attribute for resource … with computed SHA-256 integrity

A `` or `` with an `integrity` hash was blocked because the downloaded file does not match that hash.

500HTTP

HTTP 500 Internal Server Error

The server hit an unexpected condition — usually an unhandled exception or misconfiguration in the application.

InvalidOperationException.NET

InvalidOperationException: Unable to resolve service for type 'X' while attempting to activate 'Y'

ASP.NET Core’s dependency injection container can’t build Y because one of its constructor dependencies (X) was never registered.

ExceptionInInitializerErrorJava

java.lang.ExceptionInInitializerError

A static initializer (static block or static field) threw an exception while the class was loading.

SyntaxError: JSONJavaScript

SyntaxError: Unexpected token < in JSON at position 0

`JSON.parse()` / `response.json()` received something that isn’t JSON — very often an HTML error page.

missing )JavaScript

SyntaxError: missing ) after argument list

A function call’s parentheses are unbalanced — often an unescaped quote or a missing comma/plus.

already declaredJavaScript

SyntaxError: Identifier 'x' has already been declared

The same let/const/class name was declared twice in the same scope.

invalid selectorJavaScript

DOMException: Failed to execute 'querySelector' on 'Document': 'x' is not a valid selector

The CSS selector string is invalid — often an ID starting with a digit or containing special characters.

Can't resolve 'fs'React

Module not found: Can't resolve 'fs' (Next.js / webpack 5)

A Node.js built-in (fs, path, crypto, net) is imported into code that runs in the browser bundle.

Module parse failedReact

Module parse failed: Unexpected token. You may need an appropriate loader to handle this file type

Webpack found syntax it can’t parse because no loader is configured for that file (JSX, TypeScript, CSS, or modern syntax in node…

Primary script unknownPHP

FastCGI sent in stderr: "Primary script unknown"

Nginx passed a script path to PHP-FPM that PHP-FPM couldn’t find — usually a wrong SCRIPT_FILENAME or root.

ELIFECYCLEnpm

npm ERR! code ELIFECYCLE / Command failed with exit code 1

An npm script (build, start, test, postinstall) exited with an error. ELIFECYCLE is only the wrapper — the real error is printed…

gyp ERR!npm

gyp ERR! build error / node-gyp rebuild failed

A dependency with native C/C++ code couldn’t compile — missing build tools, Python, or an unsupported Node version.

COPY failedDocker

COPY failed: file not found in build context / "/app/x": not found

The Dockerfile COPY refers to a path outside the build context, excluded by .dockerignore, or relative to the wrong directory.

Unsupported class file major versionAndroid

Gradle: Unsupported class file major version / Android Gradle plugin requires Java 17 to run

The JDK running Gradle doesn’t match what the Gradle version or Android Gradle Plugin (AGP) supports.

JAVA_HOME not setJava

ERROR: JAVA_HOME is not set and no 'java' command could be found in your PATH.

Build tools (Gradle, Maven, Android tools) can’t find a JDK.

release version not supportedJava

[ERROR] Fatal error compiling: error: release version 17 not supported

The JDK running Maven is older than the Java version the project compiles for.

CrashLoopBackOffKubernetes

Kubernetes: CrashLoopBackOff

The container starts, crashes (or exits), and Kubernetes keeps restarting it with increasing back-off delays.

502HTTP

HTTP 502 Bad Gateway

A proxy or gateway (Nginx, load balancer, CDN) got an invalid response — or no response — from the upstream server behind it.

No job functions foundAzure

Azure Functions: No job functions found. Try making your job classes and methods public / Error indexing method

The Functions host started but couldn’t discover or index any functions — wrong project structure, extension/binding problems or…

ImagePullBackOffKubernetes

Kubernetes: ImagePullBackOff / ErrImagePull

The node can’t pull the container image — wrong name/tag, missing registry credentials, or registry unreachable.

exec format errorDocker

exec /usr/local/bin/docker-entrypoint.sh: exec format error

The container tried to run a binary built for a different CPU architecture (arm64 vs amd64) — or a script with a broken shebang /…

GD missingPHP

Fatal error: Uncaught Error: Call to undefined function imagecreatefromjpeg()

The GD extension (or its JPEG/WebP support) isn’t installed for the PHP version serving the site.

DevTools failed to load source mapBrowser

DevTools: Failed to load source map — Could not load content for https://…/app.js.map: HTTP error: status code 404

DevTools could not download the `.map` file that a script or stylesheet points to, so you see minified code instead of your sourc…