Error map

Service worker registration failed Console: Failed to register a ServiceWorker: A bad HTTP response code (404) was received when fetching the script

Browser · layer 1, On your device

Open the full error page →

Centre: this error. First ring: errors it is linked with (8). Outer ring: what those are linked with. Colours show the layer of a request each error belongs to. Click any dot to re-centre the map on it; hover to follow its connections. The centre dot opens the error page.

Service worker registration failed — Console: Failed to register a ServiceWorker: A bad HTTP response code (404) was received when fetching the script (Browser)Service wor…404 — HTTP 404 Not Found (HTTP)404module MIME type — Failed to load module script: Expected a JavaScript module script but the server responded with a MIME type of "text/html" (JavaScript)module MIME typeMIME type not executable — Refused to execute script from 'x' because its MIME type ('text/html') is not executable (JavaScript)MIME type not execu…Aw, Snap! — Chrome: Aw, Snap! Something went wrong while displaying this webpage. Error code: STATUS_ACCESS_VIOLATION / SIGILL / Out of Memory (Browser)Aw, Snap!captive portal — Browser: This network requires you to sign in — captive portal (hotel, airport, café Wi-Fi) blocking HTTPS sites (Browser)captive portalVersionError — Console: VersionError: The requested version (1) is less than the existing version (2) — IndexedDB open() failed (Browser)VersionErrorUnchecked runtime.lastError — Console: Unchecked runtime.lastError: The message port closed before a response was received (extension message) (Browser)Unchecked runtime.l…The canvas has been tainted by cross-origin data — Console: SecurityError: Failed to execute 'toDataURL' / 'getImageData' on 'HTMLCanvasElement': Tainted canvases may not be exported (Browser)The canvas has been…403 — HTTP 403 Forbidden (HTTP)403405 — HTTP 405 Method Not Allowed (HTTP)405410 — HTTP 410 Gone (HTTP)410App Service Application Error — Azure App Service: ":( Application Error" / container didn’t respond to HTTP pings (Azure)App Service Applica…FileNotFoundException assembly — Could not load file or assembly 'X, Version=…' or one of its dependencies (.NET)FileNotFoundExcepti…Unexpected token < — SyntaxError: Unexpected token '<' (HTML served instead of JavaScript) (JavaScript)Unexpected token <ChunkLoadError — ChunkLoadError: Loading chunk 123 failed. (JavaScript)ChunkLoadErrorOPcache stale code — PHP still runs old code after deploy (OPcache not reset) (PHP)OPcache stale codeYou must install or update .NET to run this application — The framework 'Microsoft.NETCore.App', version '8.0.0' (x64) was not found. You must install or update .NET to run this application (.NET)You must install or…MEMORY_MANAGEMENT — Blue Screen: MEMORY_MANAGEMENT (Stop code 0x0000001A) (Windows)MEMORY_MANAGEMENTinvalid array length — RangeError: Invalid array length (JavaScript)invalid array lengthERR_CONTENT_DECODING_FAILED — Chrome: This page isn’t working — sent an invalid response. ERR_CONTENT_DECODING_FAILED (Browser)ERR_CONTENT_DECODIN…407 — HTTP 407 Proxy Authentication Required (HTTP)407408 — HTTP 408 Request Timeout (HTTP)408Failed to fetch — TypeError: Failed to fetch / NetworkError when attempting to fetch resource (JavaScript)Failed to fetchQuotaExceededError — QuotaExceededError: Failed to execute 'setItem' on 'Storage': Setting the value exceeded the quota (JavaScript)QuotaExceededErrorSecurityError: Failed to read the 'localStorage' property — Console: SecurityError: Failed to read the 'localStorage' property from 'Window': Access is denied for this document (Browser)SecurityError: Fail…ERR_BLOCKED_BY_CLIENT — net::ERR_BLOCKED_BY_CLIENT (JavaScript)ERR_BLOCKED_BY_CLIE…Page Unresponsive — Chrome: Page Unresponsive — The following page(s) have become unresponsive. You can wait for them to become responsive or exit the page(s) (Browser)Page UnresponsiveUncaught (in promise) — Console: Uncaught (in promise) Error / TypeError / DOMException — unhandled promise rejection (Browser)Uncaught (in promis…CORS — CORS Error: No 'Access-Control-Allow-Origin' header is present (API)CORSclipboard write blocked — NotAllowedError: Failed to execute 'writeText' on 'Clipboard': Document is not focused. (JavaScript)clipboard write blo…net::ERR_FAILED — Chrome DevTools: net::ERR_FAILED — a request failed with no specific reason (CORS, extension, mixed content or network) (Browser)net::ERR_FAILED

Directly related (8)

404HTTP

HTTP 404 Not Found

The server can’t find anything at the requested URL.

module MIME typeJavaScript

Failed to load module script: Expected a JavaScript module script but the server responded with a MIME type of "text/html"

A or dynamic import got HTML back instead of JavaScript.

MIME type not executableJavaScript

Refused to execute script from 'x' because its MIME type ('text/html') is not executable

The browser fetched a script but the server labelled it text/html (usually an error page), so it refused to run it.

Aw, Snap!Browser

Chrome: Aw, Snap! Something went wrong while displaying this webpage. Error code: STATUS_ACCESS_VIOLATION / SIGILL / Out of Memory

A Chrome tab crashed — out of memory, a faulty extension, a graphics/driver issue or a very heavy page.

captive portalBrowser

Browser: This network requires you to sign in — captive portal (hotel, airport, café Wi-Fi) blocking HTTPS sites

The Wi-Fi needs a login or acceptance page first; until you complete it, secure sites fail with certificate or connection errors.

VersionErrorBrowser

Console: VersionError: The requested version (1) is less than the existing version (2) — IndexedDB open() failed

`indexedDB.open(name, version)` was called with a lower version number than the database already has.

Unchecked runtime.lastErrorBrowser

Console: Unchecked runtime.lastError: The message port closed before a response was received (extension message)

A browser extension sent or received a message and the other side closed the channel without replying — almost always an extensio…

The canvas has been tainted by cross-origin dataBrowser

Console: SecurityError: Failed to execute 'toDataURL' / 'getImageData' on 'HTMLCanvasElement': Tainted canvases may not be exported

You drew an image from another origin onto a canvas without CORS permission, so the browser blocks reading pixels back out.

Two steps away (23)

403HTTP

HTTP 403 Forbidden

The server understood the request but refuses to authorize it — you (or the server process) are not allowed to access this resour…

405HTTP

HTTP 405 Method Not Allowed

The URL exists, but it doesn’t accept the HTTP method you used (e.g. POST to a GET-only route).

410HTTP

HTTP 410 Gone

The resource used to exist but was intentionally and permanently removed, with no forwarding address.

App Service Application ErrorAzure

Azure App Service: ":( Application Error" / container didn’t respond to HTTP pings

App Service started your app but it crashed or never listened on the expected port.

FileNotFoundException assembly.NET

Could not load file or assembly 'X, Version=…' or one of its dependencies

The runtime couldn’t find or load a referenced DLL — missing from the output, wrong version, or wrong platform (x86/x64).

Unexpected token <JavaScript

SyntaxError: Unexpected token '<' (HTML served instead of JavaScript)

The browser loaded a .js file but received HTML (an error page or the SPA index.html).

ChunkLoadErrorJavaScript

ChunkLoadError: Loading chunk 123 failed.

A lazily loaded JavaScript chunk couldn’t be downloaded — usually because a new deployment removed the old hashed files.

OPcache stale codePHP

PHP still runs old code after deploy (OPcache not reset)

OPcache keeps serving cached bytecode, so changes uploaded to the server don’t take effect.

You must install or update .NET to run this application.NET

The framework 'Microsoft.NETCore.App', version '8.0.0' (x64) was not found. You must install or update .NET to run this application

The machine doesn’t have the .NET runtime version the app was built for (framework-dependent deployment).

MEMORY_MANAGEMENTWindows

Blue Screen: MEMORY_MANAGEMENT (Stop code 0x0000001A)

Windows detected a severe memory-management error — commonly faulty RAM, unstable memory settings or a bad driver.

invalid array lengthJavaScript

RangeError: Invalid array length

An array was created or resized with a negative, fractional or enormous length.

ERR_CONTENT_DECODING_FAILEDBrowser

Chrome: This page isn’t working — sent an invalid response. ERR_CONTENT_DECODING_FAILED

The response claims to be compressed (gzip/brotli) but cannot be decompressed — it was double-compressed, truncated or not compre…

407HTTP

HTTP 407 Proxy Authentication Required

A proxy between you and the server requires credentials before it will forward your request.

408HTTP

HTTP 408 Request Timeout

The server closed the connection because the client took too long to send the complete request.

Failed to fetchJavaScript

TypeError: Failed to fetch / NetworkError when attempting to fetch resource

The browser couldn’t complete the request at the network level — CORS, DNS, offline, blocked mixed content, or the server refused…

QuotaExceededErrorJavaScript

QuotaExceededError: Failed to execute 'setItem' on 'Storage': Setting the value exceeded the quota

localStorage/sessionStorage is full (about 5 MB per origin) or storage is disabled.

SecurityError: Failed to read the 'localStorage' propertyBrowser

Console: SecurityError: Failed to read the 'localStorage' property from 'Window': Access is denied for this document

The page cannot use `localStorage` because cookies/site data are blocked, it runs in a sandboxed iframe, or the browser is in a r…

ERR_BLOCKED_BY_CLIENTJavaScript

net::ERR_BLOCKED_BY_CLIENT

A browser extension (ad blocker, privacy tool) blocked the request.

Page UnresponsiveBrowser

Chrome: Page Unresponsive — The following page(s) have become unresponsive. You can wait for them to become responsive or exit the page(s)

A tab is stuck in a busy loop or waiting on something heavy, so Chrome offers to wait or kill it.

Uncaught (in promise)Browser

Console: Uncaught (in promise) Error / TypeError / DOMException — unhandled promise rejection

A promise was rejected and no `.catch()` or `try/catch` handled it, so the browser logs it as an unhandled rejection.

CORSAPI

CORS Error: No 'Access-Control-Allow-Origin' header is present

The browser blocked a cross-origin request because the server’s response didn’t include the CORS headers allowing your site’s ori…

clipboard write blockedJavaScript

NotAllowedError: Failed to execute 'writeText' on 'Clipboard': Document is not focused.

The Clipboard API refused to write — the page isn’t focused, there was no user gesture, or the context isn’t secure.

net::ERR_FAILEDBrowser

Chrome DevTools: net::ERR_FAILED — a request failed with no specific reason (CORS, extension, mixed content or network)

ERR_FAILED is Chrome’s catch-all for a failed request. In DevTools it very often hides a CORS rejection, an extension, or a block…