Error map

ChunkLoadError ChunkLoadError: Loading chunk 123 failed.

JavaScript · layer 1, On your device

Open the full error page →

Centre: this error. First ring: errors it is linked with (12). Outer ring: what those are linked with. Colours show the layer of a request each error belongs to. Click any dot to re-centre the map on it; hover to follow its connections. The centre dot opens the error page.

ChunkLoadError — ChunkLoadError: Loading chunk 123 failed. (JavaScript)ChunkLoadEr…FileNotFoundException assembly — Could not load file or assembly 'X, Version=…' or one of its dependencies (.NET)FileNotFoundExcepti…Module parse failed — Module parse failed: Unexpected token. You may need an appropriate loader to handle this file type (React)Module parse failedmodule MIME type — Failed to load module script: Expected a JavaScript module script but the server responded with a MIME type of "text/html" (JavaScript)module MIME typeUnexpected token < — SyntaxError: Unexpected token '<' (HTML served instead of JavaScript) (JavaScript)Unexpected token <invalid selector — DOMException: Failed to execute 'querySelector' on 'Document': 'x' is not a valid selector (JavaScript)invalid selectorOPcache stale code — PHP still runs old code after deploy (OPcache not reset) (PHP)OPcache stale codeCan't resolve 'fs' — Module not found: Can't resolve 'fs' (Next.js / webpack 5) (React)Can't resolve 'fs'You must install or update .NET to run this application — The framework 'Microsoft.NETCore.App', version '8.0.0' (x64) was not found. You must install or update .NET to run this application (.NET)You must install or…App Service Application Error — Azure App Service: ":( Application Error" / container didn’t respond to HTTP pings (Azure)App Service Applica…MIME type not executable — Refused to execute script from 'x' because its MIME type ('text/html') is not executable (JavaScript)MIME type not execu…DevTools failed to load source map — DevTools: Failed to load source map — Could not load content for https://…/app.js.map: HTTP error: status code 404 (Browser)DevTools failed to …exceeded maximum budget — Angular build: Error: bundle initial exceeded maximum budget. Budget 1.00 MB was not met by 120.00 kB with a total of 1.12 MB (Angular)exceeded maximum bu…ClassNotFoundException — java.lang.ClassNotFoundException / NoClassDefFoundError (Java)ClassNotFoundExcept…500.30 — HTTP Error 500.30 - ASP.NET Core app failed to start (.NET)500.30NETSDK1045 — error NETSDK1045: The current .NET SDK does not support targeting .NET 8.0. Either target .NET 7.0 or lower, or use a version of the .NET SDK that supports .NET 8.0 (.NET)NETSDK1045COPY failed — COPY failed: file not found in build context / "/app/x": not found (Docker)COPY failedGradle wrapper main class — Error: Could not find or load main class org.gradle.wrapper.GradleWrapperMain (Java)Gradle wrapper main…ERR_OSSL_EVP_UNSUPPORTED — Error: error:0308010C:digital envelope routines::unsupported (Node.js)ERR_OSSL_EVP_UNSUPP…Refused to apply style from — Console: Refused to apply style from 'https://…/style.css' because its MIME type ('text/html') is not a supported stylesheet MIME type (Browser)Refused to apply st…Service worker registration failed — Console: Failed to register a ServiceWorker: A bad HTTP response code (404) was received when fetching the script (Browser)Service worker regi…Failed to find a valid digest in the 'integrity' attribute — Console: Failed to find a valid digest in the 'integrity' attribute for resource … with computed SHA-256 integrity (Browser)Failed to find a va…SyntaxError: JSON — SyntaxError: Unexpected token < in JSON at position 0 (JavaScript)SyntaxError: JSONmissing ) — SyntaxError: missing ) after argument list (JavaScript)missing )already declared — SyntaxError: Identifier 'x' has already been declared (JavaScript)already declaredaddEventListener on null — TypeError: Cannot read properties of null (reading 'addEventListener') (JavaScript)addEventListener on…ResizeObserver loop — ResizeObserver loop completed with undelivered notifications. (JavaScript)ResizeObserver loopAbortError — AbortError: The user aborted a request. / signal is aborted without reason (JavaScript)AbortErrorPrimary script unknown — FastCGI sent in stderr: "Primary script unknown" (PHP)Primary script unkn…MODULE_NOT_FOUND — Error: Cannot find module 'x' (MODULE_NOT_FOUND) (Node.js)MODULE_NOT_FOUNDHydration failed — Error: Hydration failed because the initial UI does not match what was rendered on the server (React)Hydration failedneeds useState — You're importing a component that needs useState. It only works in a Client Component but none of its parents are marked with "use client" (React)needs useStateUnsupportedClassVersionError — java.lang.UnsupportedClassVersionError: class file version 61.0, this version of the Java Runtime only recognizes up to 55.0 (Java)UnsupportedClassVer…System.Drawing.Common is not supported — PlatformNotSupportedException: System.Drawing.Common is not supported on this platform (.NET)System.Drawing.Comm…CrashLoopBackOff — Kubernetes: CrashLoopBackOff (Kubernetes)CrashLoopBackOff502 — HTTP 502 Bad Gateway (HTTP)502No job functions found — Azure Functions: No job functions found. Try making your job classes and methods public / Error indexing method (Azure)No job functions fo…404 — HTTP 404 Not Found (HTTP)404net::ERR_FAILED — Chrome DevTools: net::ERR_FAILED — a request failed with no specific reason (CORS, extension, mixed content or network) (Browser)net::ERR_FAILEDAw, Snap! — Chrome: Aw, Snap! Something went wrong while displaying this webpage. Error code: STATUS_ACCESS_VIOLATION / SIGILL / Out of Memory (Browser)Aw, Snap!NG0200 — Angular: NG0200: Circular dependency in DI detected for X (Angular)NG0200NG0201 — Angular: NG0201: No provider for X found in NodeInjector (Angular)NG0201NG0300 — Angular: NG0300: Multiple components match node with tagname app-x: A and B (Angular)NG0300

Directly related (12)

FileNotFoundException assembly.NET

Could not load file or assembly 'X, Version=…' or one of its dependencies

The runtime couldn’t find or load a referenced DLL — missing from the output, wrong version, or wrong platform (x86/x64).

Module parse failedReact

Module parse failed: Unexpected token. You may need an appropriate loader to handle this file type

Webpack found syntax it can’t parse because no loader is configured for that file (JSX, TypeScript, CSS, or modern syntax in node…

module MIME typeJavaScript

Failed to load module script: Expected a JavaScript module script but the server responded with a MIME type of "text/html"

A or dynamic import got HTML back instead of JavaScript.

Unexpected token <JavaScript

SyntaxError: Unexpected token '<' (HTML served instead of JavaScript)

The browser loaded a .js file but received HTML (an error page or the SPA index.html).

invalid selectorJavaScript

DOMException: Failed to execute 'querySelector' on 'Document': 'x' is not a valid selector

The CSS selector string is invalid — often an ID starting with a digit or containing special characters.

OPcache stale codePHP

PHP still runs old code after deploy (OPcache not reset)

OPcache keeps serving cached bytecode, so changes uploaded to the server don’t take effect.

Can't resolve 'fs'React

Module not found: Can't resolve 'fs' (Next.js / webpack 5)

A Node.js built-in (fs, path, crypto, net) is imported into code that runs in the browser bundle.

You must install or update .NET to run this application.NET

The framework 'Microsoft.NETCore.App', version '8.0.0' (x64) was not found. You must install or update .NET to run this application

The machine doesn’t have the .NET runtime version the app was built for (framework-dependent deployment).

App Service Application ErrorAzure

Azure App Service: ":( Application Error" / container didn’t respond to HTTP pings

App Service started your app but it crashed or never listened on the expected port.

MIME type not executableJavaScript

Refused to execute script from 'x' because its MIME type ('text/html') is not executable

The browser fetched a script but the server labelled it text/html (usually an error page), so it refused to run it.

DevTools failed to load source mapBrowser

DevTools: Failed to load source map — Could not load content for https://…/app.js.map: HTTP error: status code 404

DevTools could not download the `.map` file that a script or stylesheet points to, so you see minified code instead of your sourc…

exceeded maximum budgetAngular

Angular build: Error: bundle initial exceeded maximum budget. Budget 1.00 MB was not met by 120.00 kB with a total of 1.12 MB

The production build is larger than the size limits (budgets) in angular.json, and the build is configured to fail.

Two steps away (30)

ClassNotFoundExceptionJava

java.lang.ClassNotFoundException / NoClassDefFoundError

The JVM couldn’t find a class on the classpath at runtime.

500.30.NET

HTTP Error 500.30 - ASP.NET Core app failed to start

IIS/Azure’s ASP.NET Core Module launched your app but it crashed during startup.

NETSDK1045.NET

error NETSDK1045: The current .NET SDK does not support targeting .NET 8.0. Either target .NET 7.0 or lower, or use a version of the .NET SDK that supports .NET 8.0

The installed .NET SDK is older than the project’s TargetFramework.

COPY failedDocker

COPY failed: file not found in build context / "/app/x": not found

The Dockerfile COPY refers to a path outside the build context, excluded by .dockerignore, or relative to the wrong directory.

Gradle wrapper main classJava

Error: Could not find or load main class org.gradle.wrapper.GradleWrapperMain

The Gradle wrapper JAR (gradle/wrapper/gradle-wrapper.jar) is missing or corrupt.

ERR_OSSL_EVP_UNSUPPORTEDNode.js

Error: error:0308010C:digital envelope routines::unsupported

An old build tool (webpack 4, old react-scripts) uses a hash algorithm that OpenSSL 3 in Node 17+ disables.

Refused to apply style fromBrowser

Console: Refused to apply style from 'https://…/style.css' because its MIME type ('text/html') is not a supported stylesheet MIME type

The stylesheet URL returned something that is not CSS — usually a 404/HTML error page — and `X-Content-Type-Options: nosniff` mak…

Service worker registration failedBrowser

Console: Failed to register a ServiceWorker: A bad HTTP response code (404) was received when fetching the script

The browser could not fetch, parse or install the service worker script, or the page is not allowed to register one (HTTPS and sc…

Failed to find a valid digest in the 'integrity' attributeBrowser

Console: Failed to find a valid digest in the 'integrity' attribute for resource … with computed SHA-256 integrity

A `` or `` with an `integrity` hash was blocked because the downloaded file does not match that hash.

SyntaxError: JSONJavaScript

SyntaxError: Unexpected token < in JSON at position 0

`JSON.parse()` / `response.json()` received something that isn’t JSON — very often an HTML error page.

missing )JavaScript

SyntaxError: missing ) after argument list

A function call’s parentheses are unbalanced — often an unescaped quote or a missing comma/plus.

already declaredJavaScript

SyntaxError: Identifier 'x' has already been declared

The same let/const/class name was declared twice in the same scope.

addEventListener on nullJavaScript

TypeError: Cannot read properties of null (reading 'addEventListener')

document.querySelector/getElementById returned null, so the element doesn’t exist when the script runs.

ResizeObserver loopJavaScript

ResizeObserver loop completed with undelivered notifications.

A ResizeObserver callback changed layout in a way that triggered another resize in the same frame.

AbortErrorJavaScript

AbortError: The user aborted a request. / signal is aborted without reason

A fetch was cancelled through an AbortController (or the browser cancelled it).

Primary script unknownPHP

FastCGI sent in stderr: "Primary script unknown"

Nginx passed a script path to PHP-FPM that PHP-FPM couldn’t find — usually a wrong SCRIPT_FILENAME or root.

MODULE_NOT_FOUNDNode.js

Error: Cannot find module 'x' (MODULE_NOT_FOUND)

Node can’t resolve the module path — the package isn’t installed, or a relative path/extension is wrong.

Hydration failedReact

Error: Hydration failed because the initial UI does not match what was rendered on the server

The HTML rendered on the server differs from the first client render, so React (Next.js/Remix) can’t attach to it.

needs useStateReact

You're importing a component that needs useState. It only works in a Client Component but none of its parents are marked with "use client"

In the Next.js App Router, a component using hooks or browser APIs is rendered as a Server Component.

UnsupportedClassVersionErrorJava

java.lang.UnsupportedClassVersionError: class file version 61.0, this version of the Java Runtime only recognizes up to 55.0

Code compiled for a newer Java version is running on an older JVM.

System.Drawing.Common is not supported.NET

PlatformNotSupportedException: System.Drawing.Common is not supported on this platform

Since .NET 6, System.Drawing.Common only works on Windows; on Linux/macOS (including Docker) it throws.

CrashLoopBackOffKubernetes

Kubernetes: CrashLoopBackOff

The container starts, crashes (or exits), and Kubernetes keeps restarting it with increasing back-off delays.

502HTTP

HTTP 502 Bad Gateway

A proxy or gateway (Nginx, load balancer, CDN) got an invalid response — or no response — from the upstream server behind it.

No job functions foundAzure

Azure Functions: No job functions found. Try making your job classes and methods public / Error indexing method

The Functions host started but couldn’t discover or index any functions — wrong project structure, extension/binding problems or…

404HTTP

HTTP 404 Not Found

The server can’t find anything at the requested URL.

net::ERR_FAILEDBrowser

Chrome DevTools: net::ERR_FAILED — a request failed with no specific reason (CORS, extension, mixed content or network)

ERR_FAILED is Chrome’s catch-all for a failed request. In DevTools it very often hides a CORS rejection, an extension, or a block…

Aw, Snap!Browser

Chrome: Aw, Snap! Something went wrong while displaying this webpage. Error code: STATUS_ACCESS_VIOLATION / SIGILL / Out of Memory

A Chrome tab crashed — out of memory, a faulty extension, a graphics/driver issue or a very heavy page.

NG0200Angular

Angular: NG0200: Circular dependency in DI detected for X

Two or more services inject each other (directly or through a chain), so Angular cannot create any of them first.

NG0201Angular

Angular: NG0201: No provider for X found in NodeInjector

A component or directive asked for a service no injector in its tree provides.

NG0300Angular

Angular: NG0300: Multiple components match node with tagname app-x: A and B

Two components in scope share the same selector, so Angular cannot decide which one renders for that tag.