Error map

Module parse failed Module parse failed: Unexpected token. You may need an appropriate loader to handle this file type

React · layer 1, On your device

Open the full error page →

Centre: this error. First ring: errors it is linked with (12). Outer ring: what those are linked with. Colours show the layer of a request each error belongs to. Click any dot to re-centre the map on it; hover to follow its connections. The centre dot opens the error page.

Module parse failed — Module parse failed: Unexpected token. You may need an appropriate loader to handle this file type (React)Module pars…lookup registry-1.docker.io: no such host — dial tcp: lookup registry-1.docker.io: no such host / Temporary failure in name resolution during docker build (Docker)lookup registry-1.d…unknown instruction — Dockerfile parse error line N: unknown instruction (Docker)unknown instructionCOPY failed — COPY failed: file not found in build context / "/app/x": not found (Docker)COPY failedPrerender error — Error occurred prerendering page "/x". Read more: https://nextjs.org/docs/messages/prerender-error (React)Prerender errorGradle wrapper main class — Error: Could not find or load main class org.gradle.wrapper.GradleWrapperMain (Java)Gradle wrapper main…ChunkLoadError — ChunkLoadError: Loading chunk 123 failed. (JavaScript)ChunkLoadErrorOutput directory not found — Cloudflare Pages build: Error: Output directory "dist" not found / Failed: build output directory not found (Cloudflare)Output directory no…NETSDK1045 — error NETSDK1045: The current .NET SDK does not support targeting .NET 8.0. Either target .NET 7.0 or lower, or use a version of the .NET SDK that supports .NET 8.0 (.NET)NETSDK1045Can't resolve 'fs' — Module not found: Can't resolve 'fs' (Next.js / webpack 5) (React)Can't resolve 'fs'react-scripts not found — 'react-scripts' is not recognized as an internal or external command / react-scripts: command not found (React)react-scripts not f…undefined reference to — C/C++: undefined reference to `function' — collect2: error: ld returned 1 exit status (C/C++)undefined reference…ERR_OSSL_EVP_UNSUPPORTED — Error: error:0308010C:digital envelope routines::unsupported (Node.js)ERR_OSSL_EVP_UNSUPP…ECONNREFUSED — Error: connect ECONNREFUSED 127.0.0.1:5432 (Node.js)ECONNREFUSED408 — HTTP 408 Request Timeout (HTTP)408Failed to fetch — TypeError: Failed to fetch / NetworkError when attempting to fetch resource (JavaScript)Failed to fetchParse error — PHP Parse error: syntax error, unexpected … (PHP)Parse errorIndentationError — IndentationError: unexpected indent / expected an indented block (Python)IndentationErrorELIFECYCLE — npm ERR! code ELIFECYCLE / Command failed with exit code 1 (npm)ELIFECYCLEnot a git repository — fatal: not a git repository (or any of the parent directories): .git (Git)not a git repositoryENOENT — Error: ENOENT: no such file or directory (Node.js)ENOENTexec format error — exec /usr/local/bin/docker-entrypoint.sh: exec format error (Docker)exec format errorHydration failed — Error: Hydration failed because the initial UI does not match what was rendered on the server (React)Hydration failedneeds useState — You're importing a component that needs useState. It only works in a Client Component but none of its parents are marked with "use client" (React)needs useStateDynamic server usage — Error: Dynamic server usage: Route /x couldn't be rendered statically because it used `cookies` (React)Dynamic server usageCould not resolve — Gradle: Could not resolve all files for configuration / Could not resolve dependency (Android)Could not resolveClassNotFoundException — java.lang.ClassNotFoundException / NoClassDefFoundError (Java)ClassNotFoundExcept…Manifest merger failed — Manifest merger failed: android:exported needs to be explicitly specified (Android)Manifest merger fai…App Service Application Error — Azure App Service: ":( Application Error" / container didn’t respond to HTTP pings (Azure)App Service Applica…FileNotFoundException assembly — Could not load file or assembly 'X, Version=…' or one of its dependencies (.NET)FileNotFoundExcepti…Unexpected token < — SyntaxError: Unexpected token '<' (HTML served instead of JavaScript) (JavaScript)Unexpected token <gyp ERR! — gyp ERR! build error / node-gyp rebuild failed (npm)gyp ERR!prisma generate — Error: @prisma/client did not initialize yet. Please run "prisma generate" (Node.js)prisma generatenode-sass — Error: Node Sass does not yet support your current environment (Node.js)node-sassVite manifest not found — Laravel: Vite manifest not found at: public/build/manifest.json (PHP)Vite manifest not f…Failed building wheel — error: subprocess-exited-with-error / Failed building wheel for x (Python)Failed building whe…did not complete successfully — failed to solve: process "/bin/sh -c ..." did not complete successfully: exit code: 1 (Docker)did not complete su…MODULE_NOT_FOUND — Error: Cannot find module 'x' (MODULE_NOT_FOUND) (Node.js)MODULE_NOT_FOUNDnext/image hostname — Error: Invalid src prop on `next/image`, hostname "x" is not configured under images in your `next.config.js` (React)next/image hostnameFunctions cannot be passed — Error: Functions cannot be passed directly to Client Components unless you explicitly expose it by marking it with "use server". (React)Functions cannot be…command not found — bash: command not found (Linux)command not foundnpx executable — npm ERR! could not determine executable to run (npm)npx executablescript command not found — sh: vite: command not found (npm script) (npm)script command not …failed to read dockerfile — failed to solve: failed to read dockerfile: open Dockerfile: no such file or directory (Docker)failed to read dock…max depth exceeded — Error response from daemon: max depth exceeded (too many image layers) (Docker)max depth exceededforbidden path outside the build context — COPY failed: forbidden path outside the build context: ../file (Docker)forbidden path outs…Sending build context — Docker build slow: "Sending build context to Docker daemon 2.5GB" / transferring context takes forever (Docker)Sending build conte…MSB3027 — error MSB3027: Could not copy "obj\...\App.dll" to "bin\...\App.dll". Exceeded retry count of 10. The file is locked by: "App (1234)" (.NET)MSB3027no start line — OpenSSL: unable to load certificate / PEM routines:get_name:no start line (key values mismatch) (SSL / TLS)no start line

Directly related (12)

lookup registry-1.docker.io: no such hostDocker

dial tcp: lookup registry-1.docker.io: no such host / Temporary failure in name resolution during docker build

DNS isn’t working for the Docker daemon or inside build containers, so pulls and package downloads fail.

unknown instructionDocker

Dockerfile parse error line N: unknown instruction

A line in the Dockerfile doesn’t start with a valid instruction — usually a broken line continuation or a typo.

COPY failedDocker

COPY failed: file not found in build context / "/app/x": not found

The Dockerfile COPY refers to a path outside the build context, excluded by .dockerignore, or relative to the wrong directory.

Prerender errorReact

Error occurred prerendering page "/x". Read more: https://nextjs.org/docs/messages/prerender-error

A page threw an error while Next.js was rendering it at build time.

Gradle wrapper main classJava

Error: Could not find or load main class org.gradle.wrapper.GradleWrapperMain

The Gradle wrapper JAR (gradle/wrapper/gradle-wrapper.jar) is missing or corrupt.

ChunkLoadErrorJavaScript

ChunkLoadError: Loading chunk 123 failed.

A lazily loaded JavaScript chunk couldn’t be downloaded — usually because a new deployment removed the old hashed files.

Output directory not foundCloudflare

Cloudflare Pages build: Error: Output directory "dist" not found / Failed: build output directory not found

The Pages build finished, but the folder set as “Build output directory” doesn’t exist — the framework wrote its files somewhere…

NETSDK1045.NET

error NETSDK1045: The current .NET SDK does not support targeting .NET 8.0. Either target .NET 7.0 or lower, or use a version of the .NET SDK that supports .NET 8.0

The installed .NET SDK is older than the project’s TargetFramework.

Can't resolve 'fs'React

Module not found: Can't resolve 'fs' (Next.js / webpack 5)

A Node.js built-in (fs, path, crypto, net) is imported into code that runs in the browser bundle.

react-scripts not foundReact

'react-scripts' is not recognized as an internal or external command / react-scripts: command not found

node_modules is missing or broken, so the react-scripts binary isn’t available.

undefined reference toC/C++

C/C++: undefined reference to `function' — collect2: error: ld returned 1 exit status

The linker can’t find the definition of a function or variable that was declared and used.

ERR_OSSL_EVP_UNSUPPORTEDNode.js

Error: error:0308010C:digital envelope routines::unsupported

An old build tool (webpack 4, old react-scripts) uses a hash algorithm that OpenSSL 3 in Node 17+ disables.

Two steps away (36)

ECONNREFUSEDNode.js

Error: connect ECONNREFUSED 127.0.0.1:5432

Nothing is listening at that host:port — the target service is down or you’re connecting to the wrong address.

408HTTP

HTTP 408 Request Timeout

The server closed the connection because the client took too long to send the complete request.

Failed to fetchJavaScript

TypeError: Failed to fetch / NetworkError when attempting to fetch resource

The browser couldn’t complete the request at the network level — CORS, DNS, offline, blocked mixed content, or the server refused…

Parse errorPHP

PHP Parse error: syntax error, unexpected …

PHP can’t parse the file because of a syntax mistake — the real error is often on the line before the one reported.

IndentationErrorPython

IndentationError: unexpected indent / expected an indented block

Python’s block structure is broken — inconsistent indentation or mixed tabs and spaces.

ELIFECYCLEnpm

npm ERR! code ELIFECYCLE / Command failed with exit code 1

An npm script (build, start, test, postinstall) exited with an error. ELIFECYCLE is only the wrapper — the real error is printed…

not a git repositoryGit

fatal: not a git repository (or any of the parent directories): .git

You ran a Git command outside a Git working tree.

ENOENTNode.js

Error: ENOENT: no such file or directory

A file or directory the program tried to open doesn’t exist at that path.

exec format errorDocker

exec /usr/local/bin/docker-entrypoint.sh: exec format error

The container tried to run a binary built for a different CPU architecture (arm64 vs amd64) — or a script with a broken shebang /…

Hydration failedReact

Error: Hydration failed because the initial UI does not match what was rendered on the server

The HTML rendered on the server differs from the first client render, so React (Next.js/Remix) can’t attach to it.

needs useStateReact

You're importing a component that needs useState. It only works in a Client Component but none of its parents are marked with "use client"

In the Next.js App Router, a component using hooks or browser APIs is rendered as a Server Component.

Dynamic server usageReact

Error: Dynamic server usage: Route /x couldn't be rendered statically because it used `cookies`

Next.js tried to statically render a route that reads request-specific data (cookies, headers, searchParams).

Could not resolveAndroid

Gradle: Could not resolve all files for configuration / Could not resolve dependency

Gradle couldn’t download a dependency — wrong coordinates/version, missing repository, offline mode, or network/proxy issues.

ClassNotFoundExceptionJava

java.lang.ClassNotFoundException / NoClassDefFoundError

The JVM couldn’t find a class on the classpath at runtime.

Manifest merger failedAndroid

Manifest merger failed: android:exported needs to be explicitly specified

Targeting Android 12 (API 31)+ requires `android:exported` on every activity, service or receiver that has an intent-filter.

App Service Application ErrorAzure

Azure App Service: ":( Application Error" / container didn’t respond to HTTP pings

App Service started your app but it crashed or never listened on the expected port.

FileNotFoundException assembly.NET

Could not load file or assembly 'X, Version=…' or one of its dependencies

The runtime couldn’t find or load a referenced DLL — missing from the output, wrong version, or wrong platform (x86/x64).

Unexpected token <JavaScript

SyntaxError: Unexpected token '<' (HTML served instead of JavaScript)

The browser loaded a .js file but received HTML (an error page or the SPA index.html).

gyp ERR!npm

gyp ERR! build error / node-gyp rebuild failed

A dependency with native C/C++ code couldn’t compile — missing build tools, Python, or an unsupported Node version.

prisma generateNode.js

Error: @prisma/client did not initialize yet. Please run "prisma generate"

The generated Prisma Client is missing or out of date.

node-sassNode.js

Error: Node Sass does not yet support your current environment

node-sass (deprecated) has no binary for your Node version/OS.

Vite manifest not foundPHP

Laravel: Vite manifest not found at: public/build/manifest.json

Laravel’s @vite directive can’t find the compiled asset manifest because assets weren’t built.

Failed building wheelPython

error: subprocess-exited-with-error / Failed building wheel for x

pip had to compile a package from source and the build failed — missing compiler, headers or system libraries.

did not complete successfullyDocker

failed to solve: process "/bin/sh -c ..." did not complete successfully: exit code: 1

A RUN step in your Dockerfile failed. The real error is printed in the lines just above this message.

MODULE_NOT_FOUNDNode.js

Error: Cannot find module 'x' (MODULE_NOT_FOUND)

Node can’t resolve the module path — the package isn’t installed, or a relative path/extension is wrong.

next/image hostnameReact

Error: Invalid src prop on `next/image`, hostname "x" is not configured under images in your `next.config.js`

next/image refuses to optimize images from domains not allowed in next.config.js.

Functions cannot be passedReact

Error: Functions cannot be passed directly to Client Components unless you explicitly expose it by marking it with "use server".

A Server Component passed a function prop to a Client Component.

command not foundLinux

bash: command not found

The shell can’t find an executable with that name in any directory on your PATH.

npx executablenpm

npm ERR! could not determine executable to run

npx couldn’t find a binary to run for that package.

script command not foundnpm

sh: vite: command not found (npm script)

A tool used in an npm script isn’t installed in node_modules/.bin.

failed to read dockerfileDocker

failed to solve: failed to read dockerfile: open Dockerfile: no such file or directory

docker build can’t find a Dockerfile in the build context you passed.

max depth exceededDocker

Error response from daemon: max depth exceeded (too many image layers)

The image has more layers than the storage driver allows (127 for overlay2), usually from repeatedly committing containers or ver…

forbidden path outside the build contextDocker

COPY failed: forbidden path outside the build context: ../file

A COPY/ADD tries to read a file above the build context (../something); Docker only sends the context folder to the builder.

Sending build contextDocker

Docker build slow: "Sending build context to Docker daemon 2.5GB" / transferring context takes forever

docker build is uploading your whole project folder — node_modules, .git, data files — before building, because there’s no (or a…

MSB3027.NET

error MSB3027: Could not copy "obj\...\App.dll" to "bin\...\App.dll". Exceeded retry count of 10. The file is locked by: "App (1234)"

The build can’t overwrite the output DLL/EXE because the app (or IIS Express, a test runner, antivirus) is still running and hold…

no start lineSSL / TLS

OpenSSL: unable to load certificate / PEM routines:get_name:no start line (key values mismatch)

OpenSSL (or Nginx/Apache) couldn’t read the certificate or key — wrong file format, wrong file, or the key doesn’t match the cert…