Error map
script command not found sh: vite: command not found (npm script)
npm · layer 7, Build & delivery
Centre: this error. First ring: errors it is linked with (12). Outer ring: what those are linked with. Colours show the layer of a request each error belongs to. Click any dot to re-centre the map on it; hover to follow its connections. The centre dot opens the error page.
Directly related (12)
npm ERR! code ELSPROBLEMS — invalid / extraneous / missing packages in npm ls
npm ls found the installed tree doesn’t match package.json and the lockfile.
npm ERR! code ELIFECYCLE / Command failed with exit code 1
An npm script (build, start, test, postinstall) exited with an error. ELIFECYCLE is only the wrapper — the real error is printed…
0x8007007E: The specified module could not be found
A DLL that a program, driver or COM component needs isn’t on disk or on the DLL search path.
error NU1101: Unable to find package X. No packages exist with this id in source(s): nuget.org
NuGet restore can’t find the package in any configured source — typo, private feed not configured/authenticated, or nuget.org mis…
error NU1605: Detected package downgrade: X from 8.0.1 to 8.0.0. Reference the package directly from the project to select a different version
A direct reference requests a lower version than a dependency needs, and NuGet treats the downgrade as an error.
npm ERR! code EOVERRIDE — Override for x conflicts with direct dependency
An "overrides" entry sets a different version for a package you also depend on directly.
npm ERR! Missing script: "start"
The script name you ran isn’t defined in package.json "scripts".
'react-scripts' is not recognized as an internal or external command / react-scripts: command not found
node_modules is missing or broken, so the react-scripts binary isn’t available.
Runtime.ImportModuleError: Unable to import module 'lambda_function': No module named 'x'
Lambda couldn’t load your handler file or one of its dependencies — the package is missing from the deployment zip/layer or the h…
Unmet dependencies / E: Unable to correct problems, you have held broken packages
apt can’t find a set of package versions that satisfies all dependencies — usually mixed repositories or a package from another r…
Dependency 'androidx.x:1.y' requires libraries and applications that depend on it to compile against version 34 or later of the Android APIs
A library needs a higher compileSdk than your module uses (checkAarMetadata task).
bash: command not found
The shell can’t find an executable with that name in any directory on your PATH.
Two steps away (36)
npm ERR! code ERESOLVE — unable to resolve dependency tree
npm 7+ found conflicting peer dependency requirements and refuses to install a broken tree.
npm ERR! code E404 — 404 Not Found: package@version is not in this registry
npm asked the registry for a package (or version) that doesn’t exist there — a typo, a private/scoped package without auth, or th…
npm ERR! code ETARGET — No matching version found for package@^9.9.9
The version range in package.json doesn’t match any published version of the package.
Error: listen EADDRINUSE: address already in use :::3000
Another process is already listening on that port.
Kubernetes: OOMKilled (exit code 137)
The container used more memory than its limit, and the kernel killed it.
gyp ERR! build error / node-gyp rebuild failed
A dependency with native C/C++ code couldn’t compile — missing build tools, Python, or an unsupported Node version.
Error: Cannot find module 'x' (MODULE_NOT_FOUND)
Node can’t resolve the module path — the package isn’t installed, or a relative path/extension is wrong.
Gradle: Could not resolve all files for configuration / Could not resolve dependency
Gradle couldn’t download a dependency — wrong coordinates/version, missing repository, offline mode, or network/proxy issues.
ModuleNotFoundError: No module named 'x'
Python can’t find the module you import — it isn’t installed in the interpreter/virtualenv that’s running, or the import path is…
ImportError: cannot import name 'x' from 'y'
The module was found, but the name you’re importing from it doesn’t exist — usually a version change or a circular import.
java.lang.ClassNotFoundException / NoClassDefFoundError
The JVM couldn’t find a class on the classpath at runtime.
Duplicate class X found in modules A and B
Two dependencies ship the same class — typically old Android Support libraries mixed with AndroidX, or Kotlin stdlib-jdk7/jdk8 ve…
Could not load file or assembly 'X, Version=…' or one of its dependencies
The runtime couldn’t find or load a referenced DLL — missing from the output, wrong version, or wrong platform (x86/x64).
CocoaPods could not find compatible versions for pod
pod install can’t satisfy the version constraints — outdated spec repo, a higher deployment target required, or two pods needing…
java.lang.NoSuchMethodError
Code compiled against one version of a library is running with another version where the method doesn’t exist.
npm ERR! code EJSONPARSE — Failed to parse json / Unexpected token in JSON at position
package.json (or package-lock.json) contains invalid JSON.
npm WARN deprecated package@1.2.3: This package is no longer supported.
A dependency (often a transitive one) is deprecated by its author.
npm ERR! code EBADPLATFORM — notsup Unsupported platform for fsevents: wanted {"os":"darwin"} (current: {"os":"linux"})
A package restricted to certain OS/CPU was installed as a required (not optional) dependency on another platform.
npm ERR! cb() never called!
An old npm crash during install — usually network/cache corruption.
Error: Cannot find matching keyid (Corepack signature verification)
An older Corepack couldn’t verify the signature of a newly published pnpm/yarn release after npm rotated its signing keys.
npm ERR! Invalid Version: (semver parse error)
A package.json or lockfile contains a version string that isn’t valid semver.
COPY failed: file not found in build context / "/app/x": not found
The Dockerfile COPY refers to a path outside the build context, excluded by .dockerignore, or relative to the wrong directory.
Error: Could not find or load main class org.gradle.wrapper.GradleWrapperMain
The Gradle wrapper JAR (gradle/wrapper/gradle-wrapper.jar) is missing or corrupt.
Error: error:0308010C:digital envelope routines::unsupported
An old build tool (webpack 4, old react-scripts) uses a hash algorithm that OpenSSL 3 in Node 17+ disables.
[ERROR] Failed to execute goal on project x: Could not resolve dependencies for project
Maven couldn’t download or find one or more dependencies.
Error [ERR_PACKAGE_PATH_NOT_EXPORTED]: Package subpath './x' is not defined by "exports"
You imported a deep path inside a package that its package.json "exports" field doesn’t expose.
npm WARN EBADENGINE Unsupported engine / The engine "node" is incompatible with this module
A package requires a different Node.js version than the one you’re running.
E: Could not get lock /var/lib/dpkg/lock-frontend — is another process using it?
apt can’t run because another package operation (often automatic updates) holds the dpkg lock.
DeprecationWarning: The `punycode` module is deprecated (DEP0040)
A dependency imports Node’s built-in punycode module, deprecated since Node 21.
npm ERR! code 128 — An unknown git error occurred (git dependency install)
npm failed to fetch a dependency that points to a Git repository.
Error: Node Sass does not yet support your current environment
node-sass (deprecated) has no binary for your Node version/OS.
Your requirements could not be resolved to an installable set of packages.
Composer can’t find package versions that satisfy every constraint (PHP version, extensions, other packages).
ERROR: Could not find a version that satisfies the requirement x (from versions: none)
pip found no installable version of the package for your Python version, OS or index.
fatal: not a git repository (or any of the parent directories): .git
You ran a Git command outside a Git working tree.
Error: ENOENT: no such file or directory
A file or directory the program tried to open doesn’t exist at that path.
Linux: Permission denied
Your user (or the service user) lacks read/write/execute permission on a file, directory or one of its parents.
Map another error
Popular: 4035004000xC000007BTypeErrorCritical error404NullPointerException