Error map

ERR_PACKAGE_PATH_NOT_EXPORTED Error [ERR_PACKAGE_PATH_NOT_EXPORTED]: Package subpath './x' is not defined by "exports"

Node.js · layer 4, Application & API

Open the full error page →

Centre: this error. First ring: errors it is linked with (12). Outer ring: what those are linked with. Colours show the layer of a request each error belongs to. Click any dot to re-centre the map on it; hover to follow its connections. The centre dot opens the error page.

ERR_PACKAGE_PATH_NOT_EXPORTED — Error [ERR_PACKAGE_PATH_NOT_EXPORTED]: Package subpath './x' is not defined by "exports" (Node.js)ERR_PACKAGE…MODULE_NOT_FOUND — Error: Cannot find module 'x' (MODULE_NOT_FOUND) (Node.js)MODULE_NOT_FOUNDEBADENGINE — npm WARN EBADENGINE Unsupported engine / The engine "node" is incompatible with this module (Node.js)EBADENGINESyntaxError import — SyntaxError: Cannot use import statement outside a module (Node.js)SyntaxError importERR_REQUIRE_ESM — Error [ERR_REQUIRE_ESM]: require() of ES Module not supported (Node.js)ERR_REQUIRE_ESMnode-sass — Error: Node Sass does not yet support your current environment (Node.js)node-sass0x8007007E — 0x8007007E: The specified module could not be found (Windows)0x8007007ENU1101 — error NU1101: Unable to find package X. No packages exist with this id in source(s): nuget.org (.NET)NU1101NU1605 — error NU1605: Detected package downgrade: X from 8.0.1 to 8.0.0. Reference the package directly from the project to select a different version (.NET)NU1605Runtime.ImportModuleError — Runtime.ImportModuleError: Unable to import module 'lambda_function': No module named 'x' (AWS)Runtime.ImportModul…held broken packages — Unmet dependencies / E: Unable to correct problems, you have held broken packages (Linux)held broken packagesDependency requires compileSdk — Dependency 'androidx.x:1.y' requires libraries and applications that depend on it to compile against version 34 or later of the Android APIs (Android)Dependency requires…ERR_IMPORT_ATTRIBUTE_MISSING — TypeError [ERR_IMPORT_ATTRIBUTE_MISSING]: Module needs an import attribute of "type: json" (Node.js)ERR_IMPORT_ATTRIBUT…ERESOLVE — npm ERR! code ERESOLVE — unable to resolve dependency tree (npm)ERESOLVEENOENT — Error: ENOENT: no such file or directory (Node.js)ENOENTTypeError: not a function — TypeError: x is not a function (JavaScript)TypeError: not a fu…Could not resolve — Gradle: Could not resolve all files for configuration / Could not resolve dependency (Android)Could not resolveDuplicate class — Duplicate class X found in modules A and B (Android)Duplicate classDEP0005 — DeprecationWarning: Buffer() is deprecated due to security and usability issues (DEP0005) (Node.js)DEP0005ReferenceError — ReferenceError: x is not defined (JavaScript)ReferenceErrorERR_HTTP_HEADERS_SENT — Error [ERR_HTTP_HEADERS_SENT]: Cannot set headers after they are sent to the client (Node.js)ERR_HTTP_HEADERS_SE…ERR_UNKNOWN_FILE_EXTENSION — TypeError [ERR_UNKNOWN_FILE_EXTENSION]: Unknown file extension ".ts" (Node.js)ERR_UNKNOWN_FILE_EX…UnhandledPromiseRejection — Node.js: [UnhandledPromiseRejection] — This error originated either by throwing inside of an async function without a catch block (Node.js)UnhandledPromiseRej…Jest ESM — Jest: SyntaxError: Cannot use import statement outside a module (Jest encountered an unexpected token) (React)Jest ESMgyp ERR! — gyp ERR! build error / node-gyp rebuild failed (npm)gyp ERR!COPY failed — COPY failed: file not found in build context / "/app/x": not found (Docker)COPY failedERR_OSSL_EVP_UNSUPPORTED — Error: error:0308010C:digital envelope routines::unsupported (Node.js)ERR_OSSL_EVP_UNSUPP…ModuleNotFoundError — ModuleNotFoundError: No module named 'x' (Python)ModuleNotFoundErrorImportError — ImportError: cannot import name 'x' from 'y' (Python)ImportErrorClassNotFoundException — java.lang.ClassNotFoundException / NoClassDefFoundError (Java)ClassNotFoundExcept…E404 — npm ERR! code E404 — 404 Not Found: package@version is not in this registry (npm)E404CocoaPods compatible versions — CocoaPods could not find compatible versions for pod (iOS)CocoaPods compatibl…NoSuchMethodError — java.lang.NoSuchMethodError (Java)NoSuchMethodErrorFileNotFoundException assembly — Could not load file or assembly 'X, Version=…' or one of its dependencies (.NET)FileNotFoundExcepti…Maven resolve — [ERROR] Failed to execute goal on project x: Could not resolve dependencies for project (Java)Maven resolveDEP0040 — DeprecationWarning: The `punycode` module is deprecated (DEP0040) (Node.js)DEP0040ETARGET — npm ERR! code ETARGET — No matching version found for package@^9.9.9 (npm)ETARGETnpm WARN deprecated — npm WARN deprecated package@1.2.3: This package is no longer supported. (npm)npm WARN deprecatedEOVERRIDE — npm ERR! code EOVERRIDE — Override for x conflicts with direct dependency (npm)EOVERRIDEdpkg lock — E: Could not get lock /var/lib/dpkg/lock-frontend — is another process using it? (Linux)dpkg lockscript command not found — sh: vite: command not found (npm script) (npm)script command not …EBADPLATFORM — npm ERR! code EBADPLATFORM — notsup Unsupported platform for fsevents: wanted {"os":"darwin"} (current: {"os":"linux"}) (npm)EBADPLATFORMnpm git dependency error — npm ERR! code 128 — An unknown git error occurred (git dependency install) (npm)npm git dependency …ELSPROBLEMS — npm ERR! code ELSPROBLEMS — invalid / extraneous / missing packages in npm ls (npm)ELSPROBLEMSComposer conflict — Your requirements could not be resolved to an installable set of packages. (PHP)Composer conflict

Directly related (12)

MODULE_NOT_FOUNDNode.js

Error: Cannot find module 'x' (MODULE_NOT_FOUND)

Node can’t resolve the module path — the package isn’t installed, or a relative path/extension is wrong.

EBADENGINENode.js

npm WARN EBADENGINE Unsupported engine / The engine "node" is incompatible with this module

A package requires a different Node.js version than the one you’re running.

SyntaxError importNode.js

SyntaxError: Cannot use import statement outside a module

An `import` statement ran in a context treated as CommonJS (Node without "type": "module", a browser script without type="module"…

ERR_REQUIRE_ESMNode.js

Error [ERR_REQUIRE_ESM]: require() of ES Module not supported

CommonJS code used `require()` on a package that is ES-module-only (node-fetch 3, chalk 5, nanoid 4, got 12…).

node-sassNode.js

Error: Node Sass does not yet support your current environment

node-sass (deprecated) has no binary for your Node version/OS.

0x8007007EWindows

0x8007007E: The specified module could not be found

A DLL that a program, driver or COM component needs isn’t on disk or on the DLL search path.

NU1101.NET

error NU1101: Unable to find package X. No packages exist with this id in source(s): nuget.org

NuGet restore can’t find the package in any configured source — typo, private feed not configured/authenticated, or nuget.org mis…

NU1605.NET

error NU1605: Detected package downgrade: X from 8.0.1 to 8.0.0. Reference the package directly from the project to select a different version

A direct reference requests a lower version than a dependency needs, and NuGet treats the downgrade as an error.

Runtime.ImportModuleErrorAWS

Runtime.ImportModuleError: Unable to import module 'lambda_function': No module named 'x'

Lambda couldn’t load your handler file or one of its dependencies — the package is missing from the deployment zip/layer or the h…

held broken packagesLinux

Unmet dependencies / E: Unable to correct problems, you have held broken packages

apt can’t find a set of package versions that satisfies all dependencies — usually mixed repositories or a package from another r…

Dependency requires compileSdkAndroid

Dependency 'androidx.x:1.y' requires libraries and applications that depend on it to compile against version 34 or later of the Android APIs

A library needs a higher compileSdk than your module uses (checkAarMetadata task).

ERR_IMPORT_ATTRIBUTE_MISSINGNode.js

TypeError [ERR_IMPORT_ATTRIBUTE_MISSING]: Module needs an import attribute of "type: json"

An ES module imported a .json file without the required import attribute.

Two steps away (32)

ERESOLVEnpm

npm ERR! code ERESOLVE — unable to resolve dependency tree

npm 7+ found conflicting peer dependency requirements and refuses to install a broken tree.

ENOENTNode.js

Error: ENOENT: no such file or directory

A file or directory the program tried to open doesn’t exist at that path.

TypeError: not a functionJavaScript

TypeError: x is not a function

You called something as a function, but its value is not a function (it’s undefined, a string, an object…).

Could not resolveAndroid

Gradle: Could not resolve all files for configuration / Could not resolve dependency

Gradle couldn’t download a dependency — wrong coordinates/version, missing repository, offline mode, or network/proxy issues.

Duplicate classAndroid

Duplicate class X found in modules A and B

Two dependencies ship the same class — typically old Android Support libraries mixed with AndroidX, or Kotlin stdlib-jdk7/jdk8 ve…

DEP0005Node.js

DeprecationWarning: Buffer() is deprecated due to security and usability issues (DEP0005)

Code (yours or a dependency) uses the deprecated new Buffer() constructor.

ReferenceErrorJavaScript

ReferenceError: x is not defined

Code refers to a variable or function name that doesn’t exist in the current scope.

ERR_HTTP_HEADERS_SENTNode.js

Error [ERR_HTTP_HEADERS_SENT]: Cannot set headers after they are sent to the client

An Express/Node handler tried to send a second response (or set headers) after one was already sent.

ERR_UNKNOWN_FILE_EXTENSIONNode.js

TypeError [ERR_UNKNOWN_FILE_EXTENSION]: Unknown file extension ".ts"

Node tried to run a TypeScript file as ESM without a TypeScript loader.

UnhandledPromiseRejectionNode.js

Node.js: [UnhandledPromiseRejection] — This error originated either by throwing inside of an async function without a catch block

A promise rejected and nothing handled it; since Node 15 this crashes the process.

Jest ESMReact

Jest: SyntaxError: Cannot use import statement outside a module (Jest encountered an unexpected token)

Jest tried to run untransformed ES module syntax — usually from a dependency in node_modules.

gyp ERR!npm

gyp ERR! build error / node-gyp rebuild failed

A dependency with native C/C++ code couldn’t compile — missing build tools, Python, or an unsupported Node version.

COPY failedDocker

COPY failed: file not found in build context / "/app/x": not found

The Dockerfile COPY refers to a path outside the build context, excluded by .dockerignore, or relative to the wrong directory.

ERR_OSSL_EVP_UNSUPPORTEDNode.js

Error: error:0308010C:digital envelope routines::unsupported

An old build tool (webpack 4, old react-scripts) uses a hash algorithm that OpenSSL 3 in Node 17+ disables.

ModuleNotFoundErrorPython

ModuleNotFoundError: No module named 'x'

Python can’t find the module you import — it isn’t installed in the interpreter/virtualenv that’s running, or the import path is…

ImportErrorPython

ImportError: cannot import name 'x' from 'y'

The module was found, but the name you’re importing from it doesn’t exist — usually a version change or a circular import.

ClassNotFoundExceptionJava

java.lang.ClassNotFoundException / NoClassDefFoundError

The JVM couldn’t find a class on the classpath at runtime.

E404npm

npm ERR! code E404 — 404 Not Found: package@version is not in this registry

npm asked the registry for a package (or version) that doesn’t exist there — a typo, a private/scoped package without auth, or th…

CocoaPods compatible versionsiOS

CocoaPods could not find compatible versions for pod

pod install can’t satisfy the version constraints — outdated spec repo, a higher deployment target required, or two pods needing…

NoSuchMethodErrorJava

java.lang.NoSuchMethodError

Code compiled against one version of a library is running with another version where the method doesn’t exist.

FileNotFoundException assembly.NET

Could not load file or assembly 'X, Version=…' or one of its dependencies

The runtime couldn’t find or load a referenced DLL — missing from the output, wrong version, or wrong platform (x86/x64).

Maven resolveJava

[ERROR] Failed to execute goal on project x: Could not resolve dependencies for project

Maven couldn’t download or find one or more dependencies.

DEP0040Node.js

DeprecationWarning: The `punycode` module is deprecated (DEP0040)

A dependency imports Node’s built-in punycode module, deprecated since Node 21.

ETARGETnpm

npm ERR! code ETARGET — No matching version found for package@^9.9.9

The version range in package.json doesn’t match any published version of the package.

npm WARN deprecatednpm

npm WARN deprecated package@1.2.3: This package is no longer supported.

A dependency (often a transitive one) is deprecated by its author.

EOVERRIDEnpm

npm ERR! code EOVERRIDE — Override for x conflicts with direct dependency

An "overrides" entry sets a different version for a package you also depend on directly.

dpkg lockLinux

E: Could not get lock /var/lib/dpkg/lock-frontend — is another process using it?

apt can’t run because another package operation (often automatic updates) holds the dpkg lock.

script command not foundnpm

sh: vite: command not found (npm script)

A tool used in an npm script isn’t installed in node_modules/.bin.

EBADPLATFORMnpm

npm ERR! code EBADPLATFORM — notsup Unsupported platform for fsevents: wanted {"os":"darwin"} (current: {"os":"linux"})

A package restricted to certain OS/CPU was installed as a required (not optional) dependency on another platform.

npm git dependency errornpm

npm ERR! code 128 — An unknown git error occurred (git dependency install)

npm failed to fetch a dependency that points to a Git repository.

ELSPROBLEMSnpm

npm ERR! code ELSPROBLEMS — invalid / extraneous / missing packages in npm ls

npm ls found the installed tree doesn’t match package.json and the lockfile.

Composer conflictPHP

Your requirements could not be resolved to an installable set of packages.

Composer can’t find package versions that satisfy every constraint (PHP version, extensions, other packages).