Error map

ERR_OSSL_EVP_UNSUPPORTED Error: error:0308010C:digital envelope routines::unsupported

Node.js · layer 4, Application & API

Open the full error page →

Centre: this error. First ring: errors it is linked with (12). Outer ring: what those are linked with. Colours show the layer of a request each error belongs to. Click any dot to re-centre the map on it; hover to follow its connections. The centre dot opens the error page.

ERR_OSSL_EVP_UNSUPPORTED — Error: error:0308010C:digital envelope routines::unsupported (Node.js)ERR_OSSL_EV…lookup registry-1.docker.io: no such host — dial tcp: lookup registry-1.docker.io: no such host / Temporary failure in name resolution during docker build (Docker)lookup registry-1.d…Module parse failed — Module parse failed: Unexpected token. You may need an appropriate loader to handle this file type (React)Module parse failedunknown instruction — Dockerfile parse error line N: unknown instruction (Docker)unknown instructiongyp ERR! — gyp ERR! build error / node-gyp rebuild failed (npm)gyp ERR!COPY failed — COPY failed: file not found in build context / "/app/x": not found (Docker)COPY failedFailed building wheel — error: subprocess-exited-with-error / Failed building wheel for x (Python)Failed building whe…Gradle wrapper main class — Error: Could not find or load main class org.gradle.wrapper.GradleWrapperMain (Java)Gradle wrapper main…Output directory not found — Cloudflare Pages build: Error: Output directory "dist" not found / Failed: build output directory not found (Cloudflare)Output directory no…NETSDK1045 — error NETSDK1045: The current .NET SDK does not support targeting .NET 8.0. Either target .NET 7.0 or lower, or use a version of the .NET SDK that supports .NET 8.0 (.NET)NETSDK1045ELIFECYCLE — npm ERR! code ELIFECYCLE / Command failed with exit code 1 (npm)ELIFECYCLEprisma generate — Error: @prisma/client did not initialize yet. Please run "prisma generate" (Node.js)prisma generatenode-sass — Error: Node Sass does not yet support your current environment (Node.js)node-sassECONNREFUSED — Error: connect ECONNREFUSED 127.0.0.1:5432 (Node.js)ECONNREFUSED408 — HTTP 408 Request Timeout (HTTP)408Failed to fetch — TypeError: Failed to fetch / NetworkError when attempting to fetch resource (JavaScript)Failed to fetchChunkLoadError — ChunkLoadError: Loading chunk 123 failed. (JavaScript)ChunkLoadErrorCan't resolve 'fs' — Module not found: Can't resolve 'fs' (Next.js / webpack 5) (React)Can't resolve 'fs'Prerender error — Error occurred prerendering page "/x". Read more: https://nextjs.org/docs/messages/prerender-error (React)Prerender errorParse error — PHP Parse error: syntax error, unexpected … (PHP)Parse errorIndentationError — IndentationError: unexpected indent / expected an indented block (Python)IndentationErrorUnexpected token < — SyntaxError: Unexpected token '<' (HTML served instead of JavaScript) (JavaScript)Unexpected token <ModuleNotFoundError — ModuleNotFoundError: No module named 'x' (Python)ModuleNotFoundErrorNo Xcode or CLT — gyp: No Xcode or CLT version detected! (npm)No Xcode or CLTsharp module — Error: Could not load the "sharp" module using the linux-x64 runtime (npm)sharp modulenot a git repository — fatal: not a git repository (or any of the parent directories): .git (Git)not a git repositoryENOENT — Error: ENOENT: no such file or directory (Node.js)ENOENTexec format error — exec /usr/local/bin/docker-entrypoint.sh: exec format error (Docker)exec format errorexternally-managed-environment — error: externally-managed-environment (Python)externally-managed-…pip no matching distribution — ERROR: Could not find a version that satisfies the requirement x (from versions: none) (Python)pip no matching dis…Sending build context — Docker build slow: "Sending build context to Docker daemon 2.5GB" / transferring context takes forever (Docker)Sending build conte…Could not resolve — Gradle: Could not resolve all files for configuration / Could not resolve dependency (Android)Could not resolveClassNotFoundException — java.lang.ClassNotFoundException / NoClassDefFoundError (Java)ClassNotFoundExcept…Manifest merger failed — Manifest merger failed: android:exported needs to be explicitly specified (Android)Manifest merger fai…ENOENT — npm ERR! enoent ENOENT: no such file or directory, open '/path/package.json' (npm)ENOENTVite manifest not found — Laravel: Vite manifest not found at: public/build/manifest.json (PHP)Vite manifest not f…react-scripts not found — 'react-scripts' is not recognized as an internal or external command / react-scripts: command not found (React)react-scripts not f…FileNotFoundException assembly — Could not load file or assembly 'X, Version=…' or one of its dependencies (.NET)FileNotFoundExcepti…did not complete successfully — failed to solve: process "/bin/sh -c ..." did not complete successfully: exit code: 1 (Docker)did not complete su…failed to read dockerfile — failed to solve: failed to read dockerfile: open Dockerfile: no such file or directory (Docker)failed to read dock…EADDRINUSE — Error: listen EADDRINUSE: address already in use :::3000 (Node.js)EADDRINUSEOOMKilled — Kubernetes: OOMKilled (exit code 137) (Kubernetes)OOMKilledheap out of memory — FATAL ERROR: Reached heap limit Allocation failed - JavaScript heap out of memory (Node.js)heap out of memoryPrisma P2002 — PrismaClientKnownRequestError P2002: Unique constraint failed on the fields: (`email`) (Node.js)Prisma P2002Prisma P1001 — Error: P1001: Can't reach database server at `host`:`5432` (Node.js)Prisma P1001MSB3027 — error MSB3027: Could not copy "obj\...\App.dll" to "bin\...\App.dll". Exceeded retry count of 10. The file is locked by: "App (1234)" (.NET)MSB3027MODULE_NOT_FOUND — Error: Cannot find module 'x' (MODULE_NOT_FOUND) (Node.js)MODULE_NOT_FOUNDERR_PACKAGE_PATH_NOT_EXPORTED — Error [ERR_PACKAGE_PATH_NOT_EXPORTED]: Package subpath './x' is not defined by "exports" (Node.js)ERR_PACKAGE_PATH_NO…EBADENGINE — npm WARN EBADENGINE Unsupported engine / The engine "node" is incompatible with this module (Node.js)EBADENGINE

Directly related (12)

lookup registry-1.docker.io: no such hostDocker

dial tcp: lookup registry-1.docker.io: no such host / Temporary failure in name resolution during docker build

DNS isn’t working for the Docker daemon or inside build containers, so pulls and package downloads fail.

Module parse failedReact

Module parse failed: Unexpected token. You may need an appropriate loader to handle this file type

Webpack found syntax it can’t parse because no loader is configured for that file (JSX, TypeScript, CSS, or modern syntax in node…

unknown instructionDocker

Dockerfile parse error line N: unknown instruction

A line in the Dockerfile doesn’t start with a valid instruction — usually a broken line continuation or a typo.

gyp ERR!npm

gyp ERR! build error / node-gyp rebuild failed

A dependency with native C/C++ code couldn’t compile — missing build tools, Python, or an unsupported Node version.

COPY failedDocker

COPY failed: file not found in build context / "/app/x": not found

The Dockerfile COPY refers to a path outside the build context, excluded by .dockerignore, or relative to the wrong directory.

Failed building wheelPython

error: subprocess-exited-with-error / Failed building wheel for x

pip had to compile a package from source and the build failed — missing compiler, headers or system libraries.

Gradle wrapper main classJava

Error: Could not find or load main class org.gradle.wrapper.GradleWrapperMain

The Gradle wrapper JAR (gradle/wrapper/gradle-wrapper.jar) is missing or corrupt.

Output directory not foundCloudflare

Cloudflare Pages build: Error: Output directory "dist" not found / Failed: build output directory not found

The Pages build finished, but the folder set as “Build output directory” doesn’t exist — the framework wrote its files somewhere…

NETSDK1045.NET

error NETSDK1045: The current .NET SDK does not support targeting .NET 8.0. Either target .NET 7.0 or lower, or use a version of the .NET SDK that supports .NET 8.0

The installed .NET SDK is older than the project’s TargetFramework.

ELIFECYCLEnpm

npm ERR! code ELIFECYCLE / Command failed with exit code 1

An npm script (build, start, test, postinstall) exited with an error. ELIFECYCLE is only the wrapper — the real error is printed…

prisma generateNode.js

Error: @prisma/client did not initialize yet. Please run "prisma generate"

The generated Prisma Client is missing or out of date.

node-sassNode.js

Error: Node Sass does not yet support your current environment

node-sass (deprecated) has no binary for your Node version/OS.

Two steps away (36)

ECONNREFUSEDNode.js

Error: connect ECONNREFUSED 127.0.0.1:5432

Nothing is listening at that host:port — the target service is down or you’re connecting to the wrong address.

408HTTP

HTTP 408 Request Timeout

The server closed the connection because the client took too long to send the complete request.

Failed to fetchJavaScript

TypeError: Failed to fetch / NetworkError when attempting to fetch resource

The browser couldn’t complete the request at the network level — CORS, DNS, offline, blocked mixed content, or the server refused…

ChunkLoadErrorJavaScript

ChunkLoadError: Loading chunk 123 failed.

A lazily loaded JavaScript chunk couldn’t be downloaded — usually because a new deployment removed the old hashed files.

Can't resolve 'fs'React

Module not found: Can't resolve 'fs' (Next.js / webpack 5)

A Node.js built-in (fs, path, crypto, net) is imported into code that runs in the browser bundle.

Prerender errorReact

Error occurred prerendering page "/x". Read more: https://nextjs.org/docs/messages/prerender-error

A page threw an error while Next.js was rendering it at build time.

Parse errorPHP

PHP Parse error: syntax error, unexpected …

PHP can’t parse the file because of a syntax mistake — the real error is often on the line before the one reported.

IndentationErrorPython

IndentationError: unexpected indent / expected an indented block

Python’s block structure is broken — inconsistent indentation or mixed tabs and spaces.

Unexpected token <JavaScript

SyntaxError: Unexpected token '<' (HTML served instead of JavaScript)

The browser loaded a .js file but received HTML (an error page or the SPA index.html).

ModuleNotFoundErrorPython

ModuleNotFoundError: No module named 'x'

Python can’t find the module you import — it isn’t installed in the interpreter/virtualenv that’s running, or the import path is…

No Xcode or CLTnpm

gyp: No Xcode or CLT version detected!

node-gyp on macOS can’t find the Xcode Command Line Tools to compile native modules.

sharp modulenpm

Error: Could not load the "sharp" module using the linux-x64 runtime

sharp’s native binary for this OS/CPU isn’t installed — usually node_modules installed on another platform (Mac → Linux/Docker).

not a git repositoryGit

fatal: not a git repository (or any of the parent directories): .git

You ran a Git command outside a Git working tree.

ENOENTNode.js

Error: ENOENT: no such file or directory

A file or directory the program tried to open doesn’t exist at that path.

exec format errorDocker

exec /usr/local/bin/docker-entrypoint.sh: exec format error

The container tried to run a binary built for a different CPU architecture (arm64 vs amd64) — or a script with a broken shebang /…

externally-managed-environmentPython

error: externally-managed-environment

Your system Python (Debian 12+, Ubuntu 23.04+, Homebrew) refuses pip installs into the OS-managed environment (PEP 668).

pip no matching distributionPython

ERROR: Could not find a version that satisfies the requirement x (from versions: none)

pip found no installable version of the package for your Python version, OS or index.

Sending build contextDocker

Docker build slow: "Sending build context to Docker daemon 2.5GB" / transferring context takes forever

docker build is uploading your whole project folder — node_modules, .git, data files — before building, because there’s no (or a…

Could not resolveAndroid

Gradle: Could not resolve all files for configuration / Could not resolve dependency

Gradle couldn’t download a dependency — wrong coordinates/version, missing repository, offline mode, or network/proxy issues.

ClassNotFoundExceptionJava

java.lang.ClassNotFoundException / NoClassDefFoundError

The JVM couldn’t find a class on the classpath at runtime.

Manifest merger failedAndroid

Manifest merger failed: android:exported needs to be explicitly specified

Targeting Android 12 (API 31)+ requires `android:exported` on every activity, service or receiver that has an intent-filter.

ENOENTnpm

npm ERR! enoent ENOENT: no such file or directory, open '/path/package.json'

npm ran in a directory without a package.json.

Vite manifest not foundPHP

Laravel: Vite manifest not found at: public/build/manifest.json

Laravel’s @vite directive can’t find the compiled asset manifest because assets weren’t built.

react-scripts not foundReact

'react-scripts' is not recognized as an internal or external command / react-scripts: command not found

node_modules is missing or broken, so the react-scripts binary isn’t available.

FileNotFoundException assembly.NET

Could not load file or assembly 'X, Version=…' or one of its dependencies

The runtime couldn’t find or load a referenced DLL — missing from the output, wrong version, or wrong platform (x86/x64).

did not complete successfullyDocker

failed to solve: process "/bin/sh -c ..." did not complete successfully: exit code: 1

A RUN step in your Dockerfile failed. The real error is printed in the lines just above this message.

failed to read dockerfileDocker

failed to solve: failed to read dockerfile: open Dockerfile: no such file or directory

docker build can’t find a Dockerfile in the build context you passed.

EADDRINUSENode.js

Error: listen EADDRINUSE: address already in use :::3000

Another process is already listening on that port.

OOMKilledKubernetes

Kubernetes: OOMKilled (exit code 137)

The container used more memory than its limit, and the kernel killed it.

heap out of memoryNode.js

FATAL ERROR: Reached heap limit Allocation failed - JavaScript heap out of memory

The V8 heap hit its limit — a large build (webpack, tsc, Next.js) needs more memory, or the app leaks.

Prisma P2002Node.js

PrismaClientKnownRequestError P2002: Unique constraint failed on the fields: (`email`)

A Prisma create/update violated a unique constraint.

Prisma P1001Node.js

Error: P1001: Can't reach database server at `host`:`5432`

Prisma couldn’t connect to the database in DATABASE_URL.

MSB3027.NET

error MSB3027: Could not copy "obj\...\App.dll" to "bin\...\App.dll". Exceeded retry count of 10. The file is locked by: "App (1234)"

The build can’t overwrite the output DLL/EXE because the app (or IIS Express, a test runner, antivirus) is still running and hold…

MODULE_NOT_FOUNDNode.js

Error: Cannot find module 'x' (MODULE_NOT_FOUND)

Node can’t resolve the module path — the package isn’t installed, or a relative path/extension is wrong.

ERR_PACKAGE_PATH_NOT_EXPORTEDNode.js

Error [ERR_PACKAGE_PATH_NOT_EXPORTED]: Package subpath './x' is not defined by "exports"

You imported a deep path inside a package that its package.json "exports" field doesn’t expose.

EBADENGINENode.js

npm WARN EBADENGINE Unsupported engine / The engine "node" is incompatible with this module

A package requires a different Node.js version than the one you’re running.