Error map

Failed building wheel error: subprocess-exited-with-error / Failed building wheel for x

Python · layer 4, Application & API

Open the full error page →

Centre: this error. First ring: errors it is linked with (12). Outer ring: what those are linked with. Colours show the layer of a request each error belongs to. Click any dot to re-centre the map on it; hover to follow its connections. The centre dot opens the error page.

Failed building wheel — error: subprocess-exited-with-error / Failed building wheel for x (Python)Failed buil…lookup registry-1.docker.io: no such host — dial tcp: lookup registry-1.docker.io: no such host / Temporary failure in name resolution during docker build (Docker)lookup registry-1.d…unknown instruction — Dockerfile parse error line N: unknown instruction (Docker)unknown instructiongyp ERR! — gyp ERR! build error / node-gyp rebuild failed (npm)gyp ERR!COPY failed — COPY failed: file not found in build context / "/app/x": not found (Docker)COPY failedGradle wrapper main class — Error: Could not find or load main class org.gradle.wrapper.GradleWrapperMain (Java)Gradle wrapper main…pip no matching distribution — ERROR: Could not find a version that satisfies the requirement x (from versions: none) (Python)pip no matching dis…Output directory not found — Cloudflare Pages build: Error: Output directory "dist" not found / Failed: build output directory not found (Cloudflare)Output directory no…NETSDK1045 — error NETSDK1045: The current .NET SDK does not support targeting .NET 8.0. Either target .NET 7.0 or lower, or use a version of the .NET SDK that supports .NET 8.0 (.NET)NETSDK1045node-sass — Error: Node Sass does not yet support your current environment (Node.js)node-sassundefined reference to — C/C++: undefined reference to `function' — collect2: error: ld returned 1 exit status (C/C++)undefined reference…ERR_OSSL_EVP_UNSUPPORTED — Error: error:0308010C:digital envelope routines::unsupported (Node.js)ERR_OSSL_EVP_UNSUPP…externally-managed-environment — error: externally-managed-environment (Python)externally-managed-…ECONNREFUSED — Error: connect ECONNREFUSED 127.0.0.1:5432 (Node.js)ECONNREFUSED408 — HTTP 408 Request Timeout (HTTP)408Failed to fetch — TypeError: Failed to fetch / NetworkError when attempting to fetch resource (JavaScript)Failed to fetchParse error — PHP Parse error: syntax error, unexpected … (PHP)Parse errorIndentationError — IndentationError: unexpected indent / expected an indented block (Python)IndentationErrorELIFECYCLE — npm ERR! code ELIFECYCLE / Command failed with exit code 1 (npm)ELIFECYCLEModuleNotFoundError — ModuleNotFoundError: No module named 'x' (Python)ModuleNotFoundErrorNo Xcode or CLT — gyp: No Xcode or CLT version detected! (npm)No Xcode or CLTsharp module — Error: Could not load the "sharp" module using the linux-x64 runtime (npm)sharp modulenot a git repository — fatal: not a git repository (or any of the parent directories): .git (Git)not a git repositoryENOENT — Error: ENOENT: no such file or directory (Node.js)ENOENTexec format error — exec /usr/local/bin/docker-entrypoint.sh: exec format error (Docker)exec format errorCould not resolve — Gradle: Could not resolve all files for configuration / Could not resolve dependency (Android)Could not resolveClassNotFoundException — java.lang.ClassNotFoundException / NoClassDefFoundError (Java)ClassNotFoundExcept…Manifest merger failed — Manifest merger failed: android:exported needs to be explicitly specified (Android)Manifest merger fai…ImportError — ImportError: cannot import name 'x' from 'y' (Python)ImportErrorE404 — npm ERR! code E404 — 404 Not Found: package@version is not in this registry (npm)E404No module named distutils — ModuleNotFoundError: No module named 'distutils' (Python)No module named dis…prisma generate — Error: @prisma/client did not initialize yet. Please run "prisma generate" (Node.js)prisma generateENOENT — npm ERR! enoent ENOENT: no such file or directory, open '/path/package.json' (npm)ENOENTVite manifest not found — Laravel: Vite manifest not found at: public/build/manifest.json (PHP)Vite manifest not f…FileNotFoundException assembly — Could not load file or assembly 'X, Version=…' or one of its dependencies (.NET)FileNotFoundExcepti…Prerender error — Error occurred prerendering page "/x". Read more: https://nextjs.org/docs/messages/prerender-error (React)Prerender errorreact-scripts not found — 'react-scripts' is not recognized as an internal or external command / react-scripts: command not found (React)react-scripts not f…MODULE_NOT_FOUND — Error: Cannot find module 'x' (MODULE_NOT_FOUND) (Node.js)MODULE_NOT_FOUNDERR_PACKAGE_PATH_NOT_EXPORTED — Error [ERR_PACKAGE_PATH_NOT_EXPORTED]: Package subpath './x' is not defined by "exports" (Node.js)ERR_PACKAGE_PATH_NO…EBADENGINE — npm WARN EBADENGINE Unsupported engine / The engine "node" is incompatible with this module (Node.js)EBADENGINEModule parse failed — Module parse failed: Unexpected token. You may need an appropriate loader to handle this file type (React)Module parse faileddid not complete successfully — failed to solve: process "/bin/sh -c ..." did not complete successfully: exit code: 1 (Docker)did not complete su…failed to read dockerfile — failed to solve: failed to read dockerfile: open Dockerfile: no such file or directory (Docker)failed to read dock…Sending build context — Docker build slow: "Sending build context to Docker daemon 2.5GB" / transferring context takes forever (Docker)Sending build conte…MSB3027 — error MSB3027: Could not copy "obj\...\App.dll" to "bin\...\App.dll". Exceeded retry count of 10. The file is locked by: "App (1234)" (.NET)MSB3027no start line — OpenSSL: unable to load certificate / PEM routines:get_name:no start line (key values mismatch) (SSL / TLS)no start lineAttributeError — AttributeError: 'X' object has no attribute 'y' (Python)AttributeErrorConnectionRefusedError — ConnectionRefusedError: [Errno 111] Connection refused (Python)ConnectionRefusedEr…Event loop is closed — RuntimeError: Event loop is closed (Python)Event loop is closed

Directly related (12)

lookup registry-1.docker.io: no such hostDocker

dial tcp: lookup registry-1.docker.io: no such host / Temporary failure in name resolution during docker build

DNS isn’t working for the Docker daemon or inside build containers, so pulls and package downloads fail.

unknown instructionDocker

Dockerfile parse error line N: unknown instruction

A line in the Dockerfile doesn’t start with a valid instruction — usually a broken line continuation or a typo.

gyp ERR!npm

gyp ERR! build error / node-gyp rebuild failed

A dependency with native C/C++ code couldn’t compile — missing build tools, Python, or an unsupported Node version.

COPY failedDocker

COPY failed: file not found in build context / "/app/x": not found

The Dockerfile COPY refers to a path outside the build context, excluded by .dockerignore, or relative to the wrong directory.

Gradle wrapper main classJava

Error: Could not find or load main class org.gradle.wrapper.GradleWrapperMain

The Gradle wrapper JAR (gradle/wrapper/gradle-wrapper.jar) is missing or corrupt.

pip no matching distributionPython

ERROR: Could not find a version that satisfies the requirement x (from versions: none)

pip found no installable version of the package for your Python version, OS or index.

Output directory not foundCloudflare

Cloudflare Pages build: Error: Output directory "dist" not found / Failed: build output directory not found

The Pages build finished, but the folder set as “Build output directory” doesn’t exist — the framework wrote its files somewhere…

NETSDK1045.NET

error NETSDK1045: The current .NET SDK does not support targeting .NET 8.0. Either target .NET 7.0 or lower, or use a version of the .NET SDK that supports .NET 8.0

The installed .NET SDK is older than the project’s TargetFramework.

node-sassNode.js

Error: Node Sass does not yet support your current environment

node-sass (deprecated) has no binary for your Node version/OS.

undefined reference toC/C++

C/C++: undefined reference to `function' — collect2: error: ld returned 1 exit status

The linker can’t find the definition of a function or variable that was declared and used.

ERR_OSSL_EVP_UNSUPPORTEDNode.js

Error: error:0308010C:digital envelope routines::unsupported

An old build tool (webpack 4, old react-scripts) uses a hash algorithm that OpenSSL 3 in Node 17+ disables.

externally-managed-environmentPython

error: externally-managed-environment

Your system Python (Debian 12+, Ubuntu 23.04+, Homebrew) refuses pip installs into the OS-managed environment (PEP 668).

Two steps away (36)

ECONNREFUSEDNode.js

Error: connect ECONNREFUSED 127.0.0.1:5432

Nothing is listening at that host:port — the target service is down or you’re connecting to the wrong address.

408HTTP

HTTP 408 Request Timeout

The server closed the connection because the client took too long to send the complete request.

Failed to fetchJavaScript

TypeError: Failed to fetch / NetworkError when attempting to fetch resource

The browser couldn’t complete the request at the network level — CORS, DNS, offline, blocked mixed content, or the server refused…

Parse errorPHP

PHP Parse error: syntax error, unexpected …

PHP can’t parse the file because of a syntax mistake — the real error is often on the line before the one reported.

IndentationErrorPython

IndentationError: unexpected indent / expected an indented block

Python’s block structure is broken — inconsistent indentation or mixed tabs and spaces.

ELIFECYCLEnpm

npm ERR! code ELIFECYCLE / Command failed with exit code 1

An npm script (build, start, test, postinstall) exited with an error. ELIFECYCLE is only the wrapper — the real error is printed…

ModuleNotFoundErrorPython

ModuleNotFoundError: No module named 'x'

Python can’t find the module you import — it isn’t installed in the interpreter/virtualenv that’s running, or the import path is…

No Xcode or CLTnpm

gyp: No Xcode or CLT version detected!

node-gyp on macOS can’t find the Xcode Command Line Tools to compile native modules.

sharp modulenpm

Error: Could not load the "sharp" module using the linux-x64 runtime

sharp’s native binary for this OS/CPU isn’t installed — usually node_modules installed on another platform (Mac → Linux/Docker).

not a git repositoryGit

fatal: not a git repository (or any of the parent directories): .git

You ran a Git command outside a Git working tree.

ENOENTNode.js

Error: ENOENT: no such file or directory

A file or directory the program tried to open doesn’t exist at that path.

exec format errorDocker

exec /usr/local/bin/docker-entrypoint.sh: exec format error

The container tried to run a binary built for a different CPU architecture (arm64 vs amd64) — or a script with a broken shebang /…

Could not resolveAndroid

Gradle: Could not resolve all files for configuration / Could not resolve dependency

Gradle couldn’t download a dependency — wrong coordinates/version, missing repository, offline mode, or network/proxy issues.

ClassNotFoundExceptionJava

java.lang.ClassNotFoundException / NoClassDefFoundError

The JVM couldn’t find a class on the classpath at runtime.

Manifest merger failedAndroid

Manifest merger failed: android:exported needs to be explicitly specified

Targeting Android 12 (API 31)+ requires `android:exported` on every activity, service or receiver that has an intent-filter.

ImportErrorPython

ImportError: cannot import name 'x' from 'y'

The module was found, but the name you’re importing from it doesn’t exist — usually a version change or a circular import.

E404npm

npm ERR! code E404 — 404 Not Found: package@version is not in this registry

npm asked the registry for a package (or version) that doesn’t exist there — a typo, a private/scoped package without auth, or th…

No module named distutilsPython

ModuleNotFoundError: No module named 'distutils'

Python 3.12 removed distutils; old packages or tools that import it fail.

prisma generateNode.js

Error: @prisma/client did not initialize yet. Please run "prisma generate"

The generated Prisma Client is missing or out of date.

ENOENTnpm

npm ERR! enoent ENOENT: no such file or directory, open '/path/package.json'

npm ran in a directory without a package.json.

Vite manifest not foundPHP

Laravel: Vite manifest not found at: public/build/manifest.json

Laravel’s @vite directive can’t find the compiled asset manifest because assets weren’t built.

FileNotFoundException assembly.NET

Could not load file or assembly 'X, Version=…' or one of its dependencies

The runtime couldn’t find or load a referenced DLL — missing from the output, wrong version, or wrong platform (x86/x64).

Prerender errorReact

Error occurred prerendering page "/x". Read more: https://nextjs.org/docs/messages/prerender-error

A page threw an error while Next.js was rendering it at build time.

react-scripts not foundReact

'react-scripts' is not recognized as an internal or external command / react-scripts: command not found

node_modules is missing or broken, so the react-scripts binary isn’t available.

MODULE_NOT_FOUNDNode.js

Error: Cannot find module 'x' (MODULE_NOT_FOUND)

Node can’t resolve the module path — the package isn’t installed, or a relative path/extension is wrong.

ERR_PACKAGE_PATH_NOT_EXPORTEDNode.js

Error [ERR_PACKAGE_PATH_NOT_EXPORTED]: Package subpath './x' is not defined by "exports"

You imported a deep path inside a package that its package.json "exports" field doesn’t expose.

EBADENGINENode.js

npm WARN EBADENGINE Unsupported engine / The engine "node" is incompatible with this module

A package requires a different Node.js version than the one you’re running.

Module parse failedReact

Module parse failed: Unexpected token. You may need an appropriate loader to handle this file type

Webpack found syntax it can’t parse because no loader is configured for that file (JSX, TypeScript, CSS, or modern syntax in node…

did not complete successfullyDocker

failed to solve: process "/bin/sh -c ..." did not complete successfully: exit code: 1

A RUN step in your Dockerfile failed. The real error is printed in the lines just above this message.

failed to read dockerfileDocker

failed to solve: failed to read dockerfile: open Dockerfile: no such file or directory

docker build can’t find a Dockerfile in the build context you passed.

Sending build contextDocker

Docker build slow: "Sending build context to Docker daemon 2.5GB" / transferring context takes forever

docker build is uploading your whole project folder — node_modules, .git, data files — before building, because there’s no (or a…

MSB3027.NET

error MSB3027: Could not copy "obj\...\App.dll" to "bin\...\App.dll". Exceeded retry count of 10. The file is locked by: "App (1234)"

The build can’t overwrite the output DLL/EXE because the app (or IIS Express, a test runner, antivirus) is still running and hold…

no start lineSSL / TLS

OpenSSL: unable to load certificate / PEM routines:get_name:no start line (key values mismatch)

OpenSSL (or Nginx/Apache) couldn’t read the certificate or key — wrong file format, wrong file, or the key doesn’t match the cert…

AttributeErrorPython

AttributeError: 'X' object has no attribute 'y'

You accessed an attribute or method that doesn’t exist on that object type.

ConnectionRefusedErrorPython

ConnectionRefusedError: [Errno 111] Connection refused

Nothing is listening on the host/port Python tried to connect to.

Event loop is closedPython

RuntimeError: Event loop is closed

Async code tried to use an event loop that has already been shut down.