Error map
lookup registry-1.docker.io: no such host dial tcp: lookup registry-1.docker.io: no such host / Temporary failure in name resolution during docker build
Docker · layer 6, Platform & cloud
Centre: this error. First ring: errors it is linked with (12). Outer ring: what those are linked with. Colours show the layer of a request each error belongs to. Click any dot to re-centre the map on it; hover to follow its connections. The centre dot opens the error page.
Directly related (12)
ERR_CONNECTION_TIMED_OUT: This site can’t be reached — example.com took too long to respond
The browser waited for the server but got no response — the server is down/unreachable, a firewall drops traffic, or DNS points t…
TypeError: Failed to fetch / NetworkError when attempting to fetch resource
The browser couldn’t complete the request at the network level — CORS, DNS, offline, blocked mixed content, or the server refused…
API Request Timed Out (ETIMEDOUT / ReadTimeout / timeout of 30000ms exceeded)
The client gave up waiting — either for the connection to open or for the response to arrive.
Module parse failed: Unexpected token. You may need an appropriate loader to handle this file type
Webpack found syntax it can’t parse because no loader is configured for that file (JSX, TypeScript, CSS, or modern syntax in node…
java.net.SocketException: Connection reset
The remote side closed the TCP connection abruptly while Java was reading or writing.
MySQL ERROR 2003 (HY000): Can't connect to MySQL server on 'host:3306' (111)
The client couldn’t reach MySQL over TCP — server down, wrong host/port, firewall, or MySQL bound to localhost only.
cURL error 6: Could not resolve host: api.example.com
PHP cURL couldn’t resolve the hostname via DNS.
SSL error: tlsv1 alert protocol version / unsupported protocol / no protocols available
The client and server couldn’t agree on a TLS version or cipher, so the HTTPS handshake failed before any HTTP was exchanged.
Get "https://registry-1.docker.io/v2/": net/http: request canceled while waiting for connection (Client.Timeout exceeded)
Docker couldn’t reach the registry in time — a network, DNS, proxy or firewall problem between your machine and the registry.
failed to solve: process "/bin/sh -c ..." did not complete successfully: exit code: 1
A RUN step in your Dockerfile failed. The real error is printed in the lines just above this message.
ERR_CONNECTION_RESET: This site can’t be reached — The connection was reset
The connection to the website was cut off mid-way — by the server, a firewall/antivirus, a VPN/proxy, or network equipment.
Error: socket hang up / read ECONNRESET
The other side closed the TCP connection abruptly while your client was still using it.
Two steps away (36)
Error: connect ECONNREFUSED 127.0.0.1:5432
Nothing is listening at that host:port — the target service is down or you’re connecting to the wrong address.
HTTP 407 Proxy Authentication Required
A proxy between you and the server requires credentials before it will forward your request.
HTTP 408 Request Timeout
The server closed the connection because the client took too long to send the complete request.
SyntaxError: Unexpected token < in JSON at position 0
`JSON.parse()` / `response.json()` received something that isn’t JSON — very often an HTML error page.
CORS Error: No 'Access-Control-Allow-Origin' header is present
The browser blocked a cross-origin request because the server’s response didn’t include the CORS headers allowing your site’s ori…
SSL: CERTIFICATE_VERIFY_FAILED / unable to get local issuer certificate
The client couldn’t verify the server’s TLS certificate chain, so it refused the HTTPS connection.
HTTP 504 Gateway Timeout
A proxy or gateway waited too long for the upstream server to respond and gave up.
Cloudflare Error 522: Connection Timed Out
Cloudflare’s TCP connection to your origin timed out — the origin didn’t answer at all.
Error: getaddrinfo ENOTFOUND host / Name or service not known
DNS lookup for the hostname failed — the name is wrong, doesn’t exist, or this machine can’t resolve it.
COPY failed: file not found in build context / "/app/x": not found
The Dockerfile COPY refers to a path outside the build context, excluded by .dockerignore, or relative to the wrong directory.
Error: Could not find or load main class org.gradle.wrapper.GradleWrapperMain
The Gradle wrapper JAR (gradle/wrapper/gradle-wrapper.jar) is missing or corrupt.
ChunkLoadError: Loading chunk 123 failed.
A lazily loaded JavaScript chunk couldn’t be downloaded — usually because a new deployment removed the old hashed files.
java.net.ConnectException: Connection refused
Nothing is listening at the host:port the Java client connected to.
java.net.UnknownHostException: api.example.com
DNS resolution failed for the hostname.
TypeError: Failed to execute 'json' on 'Response': body stream already read
A fetch Response body was consumed twice (e.g. calling .text() then .json()).
MySQL ERROR 2002 (HY000): Can't connect to local MySQL server through socket
The client couldn’t reach the MySQL server — it isn’t running, or the client is looking for the socket/port in the wrong place.
MySQL ERROR 2006 (HY000): MySQL server has gone away
The connection to MySQL was closed — usually by a timeout or a packet larger than `max_allowed_packet`.
MySQL ERROR 1040 (08004): Too many connections
MySQL reached `max_connections` and refuses new clients.
fatal: unable to access 'https://github.com/…': Could not resolve host: github.com
DNS lookup for the Git host failed from this machine.
cURL error 28: Operation timed out after 30001 milliseconds with 0 bytes received
A PHP cURL (or Guzzle) request timed out before the remote server answered.
cURL error 35: OpenSSL SSL_connect: SSL_ERROR_SYSCALL in connection to host:443
The TLS handshake failed — protocol/cipher mismatch, a proxy interfering, or the server closed the connection.
Mixed Content: The page was loaded over HTTPS, but requested an insecure resource
An HTTPS page tried to load a script, API or image over plain HTTP, and the browser blocked (or warned about) it.
CLEARTEXT communication to host not permitted by network security policy
Android 9+ blocks plain `http://` requests by default; the app tried to call a non-HTTPS URL.
App Transport Security has blocked a cleartext HTTP resource load
iOS blocked an `http://` request (or a weak-TLS HTTPS one) because App Transport Security requires secure connections.
error: RPC failed; HTTP 400 curl 22 / curl 92 HTTP/2 stream was not closed cleanly — the remote end hung up unexpectedly
A large HTTPS push/clone broke mid-transfer — size limits, proxies or flaky HTTP/2.
fatal: early EOF — fatal: index-pack failed
A clone or fetch was cut off mid-transfer.
net::ERR_BLOCKED_BY_CLIENT
A browser extension (ad blocker, privacy tool) blocked the request.
failed to solve: failed to read dockerfile: open Dockerfile: no such file or directory
docker build can’t find a Dockerfile in the build context you passed.
Dockerfile parse error line N: unknown instruction
A line in the Dockerfile doesn’t start with a valid instruction — usually a broken line continuation or a typo.
Error response from daemon: max depth exceeded (too many image layers)
The image has more layers than the storage driver allows (127 for overlay2), usually from repeatedly committing containers or ver…
ssh: connect to host github.com port 22: Connection timed out
Outbound SSH on port 22 is blocked (firewall, corporate or public Wi-Fi).
kex_exchange_identification: Connection closed by remote host
The SSH connection was closed before the handshake — server overload, rate limiting, or a proxy/firewall interfering.
QuotaExceededError: Failed to execute 'setItem' on 'Storage': Setting the value exceeded the quota
localStorage/sessionStorage is full (about 5 MB per origin) or storage is disabled.
HTTP 502 Bad Gateway
A proxy or gateway (Nginx, load balancer, CDN) got an invalid response — or no response — from the upstream server behind it.
Too many open files (EMFILE)
The process hit its file-descriptor limit — sockets, files and pipes all count.
WebSocket connection to 'wss://x' failed
The browser couldn’t open (or keep) a WebSocket connection.
Map another error
Popular: 403500400TypeErrorCritical error0xC000007BNullPointerException404