Error map

did not complete successfully failed to solve: process "/bin/sh -c ..." did not complete successfully: exit code: 1

Docker · layer 6, Platform & cloud

Open the full error page →

Centre: this error. First ring: errors it is linked with (12). Outer ring: what those are linked with. Colours show the layer of a request each error belongs to. Click any dot to re-centre the map on it; hover to follow its connections. The centre dot opens the error page.

did not complete successfully — failed to solve: process "/bin/sh -c ..." did not complete successfully: exit code: 1 (Docker)did not com…lookup registry-1.docker.io: no such host — dial tcp: lookup registry-1.docker.io: no such host / Temporary failure in name resolution during docker build (Docker)lookup registry-1.d…unknown instruction — Dockerfile parse error line N: unknown instruction (Docker)unknown instructionCOPY failed — COPY failed: file not found in build context / "/app/x": not found (Docker)COPY failedOutput directory not found — Cloudflare Pages build: Error: Output directory "dist" not found / Failed: build output directory not found (Cloudflare)Output directory no…NETSDK1045 — error NETSDK1045: The current .NET SDK does not support targeting .NET 8.0. Either target .NET 7.0 or lower, or use a version of the .NET SDK that supports .NET 8.0 (.NET)NETSDK1045failed to read dockerfile — failed to solve: failed to read dockerfile: open Dockerfile: no such file or directory (Docker)failed to read dock…forbidden path outside the build context — COPY failed: forbidden path outside the build context: ../file (Docker)forbidden path outs…Unable to locate package — E: Unable to locate package (apt / apt-get install) (Linux)Unable to locate pa…undefined reference to — C/C++: undefined reference to `function' — collect2: error: ld returned 1 exit status (C/C++)undefined reference…Sending build context — Docker build slow: "Sending build context to Docker daemon 2.5GB" / transferring context takes forever (Docker)Sending build conte…MSB3027 — error MSB3027: Could not copy "obj\...\App.dll" to "bin\...\App.dll". Exceeded retry count of 10. The file is locked by: "App (1234)" (.NET)MSB3027max depth exceeded — Error response from daemon: max depth exceeded (too many image layers) (Docker)max depth exceededECONNREFUSED — Error: connect ECONNREFUSED 127.0.0.1:5432 (Node.js)ECONNREFUSED408 — HTTP 408 Request Timeout (HTTP)408Failed to fetch — TypeError: Failed to fetch / NetworkError when attempting to fetch resource (JavaScript)Failed to fetchParse error — PHP Parse error: syntax error, unexpected … (PHP)Parse errorIndentationError — IndentationError: unexpected indent / expected an indented block (Python)IndentationErrorELIFECYCLE — npm ERR! code ELIFECYCLE / Command failed with exit code 1 (npm)ELIFECYCLEnot a git repository — fatal: not a git repository (or any of the parent directories): .git (Git)not a git repositoryENOENT — Error: ENOENT: no such file or directory (Node.js)ENOENTexec format error — exec /usr/local/bin/docker-entrypoint.sh: exec format error (Docker)exec format errorgyp ERR! — gyp ERR! build error / node-gyp rebuild failed (npm)gyp ERR!Gradle wrapper main class — Error: Could not find or load main class org.gradle.wrapper.GradleWrapperMain (Java)Gradle wrapper main…ERR_OSSL_EVP_UNSUPPORTED — Error: error:0308010C:digital envelope routines::unsupported (Node.js)ERR_OSSL_EVP_UNSUPP…FileNotFoundException assembly — Could not load file or assembly 'X, Version=…' or one of its dependencies (.NET)FileNotFoundExcepti…prisma generate — Error: @prisma/client did not initialize yet. Please run "prisma generate" (Node.js)prisma generatenode-sass — Error: Node Sass does not yet support your current environment (Node.js)node-sassdpkg lock — E: Could not get lock /var/lib/dpkg/lock-frontend — is another process using it? (Linux)dpkg lockSub-process /usr/bin/dpkg returned an error code (1) — E: Sub-process /usr/bin/dpkg returned an error code (1) (Linux)Sub-process /usr/bi…dpkg was interrupted — E: dpkg was interrupted, you must manually run 'sudo dpkg --configure -a' to correct the problem (Linux)dpkg was interruptedVite manifest not found — Laravel: Vite manifest not found at: public/build/manifest.json (PHP)Vite manifest not f…Failed building wheel — error: subprocess-exited-with-error / Failed building wheel for x (Python)Failed building whe…Prerender error — Error occurred prerendering page "/x". Read more: https://nextjs.org/docs/messages/prerender-error (React)Prerender errorENOSPC — no space left on device (Docker / Linux) (Docker)ENOSPC504 — HTTP 504 Gateway Timeout (HTTP)504524 — Cloudflare Error 524: A Timeout Occurred (Cloudflare)524react-scripts not found — 'react-scripts' is not recognized as an internal or external command / react-scripts: command not found (React)react-scripts not f…Module parse failed — Module parse failed: Unexpected token. You may need an appropriate loader to handle this file type (React)Module parse failedText file busy — Text file busy (ETXTBSY) when replacing or running a binary (Linux)Text file busyno matching manifest — no matching manifest for linux/arm64/v8 in the manifest list entries (Docker)no matching manifestconflict: unable to remove repository reference — conflict: unable to remove repository reference (must force) - container is using its referenced image (Docker)conflict: unable to…image has dependent child images — conflict: unable to delete image (cannot be forced) - image has dependent child images (Docker)image has dependent…

Directly related (12)

lookup registry-1.docker.io: no such hostDocker

dial tcp: lookup registry-1.docker.io: no such host / Temporary failure in name resolution during docker build

DNS isn’t working for the Docker daemon or inside build containers, so pulls and package downloads fail.

unknown instructionDocker

Dockerfile parse error line N: unknown instruction

A line in the Dockerfile doesn’t start with a valid instruction — usually a broken line continuation or a typo.

COPY failedDocker

COPY failed: file not found in build context / "/app/x": not found

The Dockerfile COPY refers to a path outside the build context, excluded by .dockerignore, or relative to the wrong directory.

Output directory not foundCloudflare

Cloudflare Pages build: Error: Output directory "dist" not found / Failed: build output directory not found

The Pages build finished, but the folder set as “Build output directory” doesn’t exist — the framework wrote its files somewhere…

NETSDK1045.NET

error NETSDK1045: The current .NET SDK does not support targeting .NET 8.0. Either target .NET 7.0 or lower, or use a version of the .NET SDK that supports .NET 8.0

The installed .NET SDK is older than the project’s TargetFramework.

failed to read dockerfileDocker

failed to solve: failed to read dockerfile: open Dockerfile: no such file or directory

docker build can’t find a Dockerfile in the build context you passed.

forbidden path outside the build contextDocker

COPY failed: forbidden path outside the build context: ../file

A COPY/ADD tries to read a file above the build context (../something); Docker only sends the context folder to the builder.

Unable to locate packageLinux

E: Unable to locate package (apt / apt-get install)

apt can’t find the package name in its package lists — the lists are stale, the repository isn’t enabled, or the name is wrong fo…

undefined reference toC/C++

C/C++: undefined reference to `function' — collect2: error: ld returned 1 exit status

The linker can’t find the definition of a function or variable that was declared and used.

Sending build contextDocker

Docker build slow: "Sending build context to Docker daemon 2.5GB" / transferring context takes forever

docker build is uploading your whole project folder — node_modules, .git, data files — before building, because there’s no (or a…

MSB3027.NET

error MSB3027: Could not copy "obj\...\App.dll" to "bin\...\App.dll". Exceeded retry count of 10. The file is locked by: "App (1234)"

The build can’t overwrite the output DLL/EXE because the app (or IIS Express, a test runner, antivirus) is still running and hold…

max depth exceededDocker

Error response from daemon: max depth exceeded (too many image layers)

The image has more layers than the storage driver allows (127 for overlay2), usually from repeatedly committing containers or ver…

Two steps away (30)

ECONNREFUSEDNode.js

Error: connect ECONNREFUSED 127.0.0.1:5432

Nothing is listening at that host:port — the target service is down or you’re connecting to the wrong address.

408HTTP

HTTP 408 Request Timeout

The server closed the connection because the client took too long to send the complete request.

Failed to fetchJavaScript

TypeError: Failed to fetch / NetworkError when attempting to fetch resource

The browser couldn’t complete the request at the network level — CORS, DNS, offline, blocked mixed content, or the server refused…

Parse errorPHP

PHP Parse error: syntax error, unexpected …

PHP can’t parse the file because of a syntax mistake — the real error is often on the line before the one reported.

IndentationErrorPython

IndentationError: unexpected indent / expected an indented block

Python’s block structure is broken — inconsistent indentation or mixed tabs and spaces.

ELIFECYCLEnpm

npm ERR! code ELIFECYCLE / Command failed with exit code 1

An npm script (build, start, test, postinstall) exited with an error. ELIFECYCLE is only the wrapper — the real error is printed…

not a git repositoryGit

fatal: not a git repository (or any of the parent directories): .git

You ran a Git command outside a Git working tree.

ENOENTNode.js

Error: ENOENT: no such file or directory

A file or directory the program tried to open doesn’t exist at that path.

exec format errorDocker

exec /usr/local/bin/docker-entrypoint.sh: exec format error

The container tried to run a binary built for a different CPU architecture (arm64 vs amd64) — or a script with a broken shebang /…

gyp ERR!npm

gyp ERR! build error / node-gyp rebuild failed

A dependency with native C/C++ code couldn’t compile — missing build tools, Python, or an unsupported Node version.

Gradle wrapper main classJava

Error: Could not find or load main class org.gradle.wrapper.GradleWrapperMain

The Gradle wrapper JAR (gradle/wrapper/gradle-wrapper.jar) is missing or corrupt.

ERR_OSSL_EVP_UNSUPPORTEDNode.js

Error: error:0308010C:digital envelope routines::unsupported

An old build tool (webpack 4, old react-scripts) uses a hash algorithm that OpenSSL 3 in Node 17+ disables.

FileNotFoundException assembly.NET

Could not load file or assembly 'X, Version=…' or one of its dependencies

The runtime couldn’t find or load a referenced DLL — missing from the output, wrong version, or wrong platform (x86/x64).

prisma generateNode.js

Error: @prisma/client did not initialize yet. Please run "prisma generate"

The generated Prisma Client is missing or out of date.

node-sassNode.js

Error: Node Sass does not yet support your current environment

node-sass (deprecated) has no binary for your Node version/OS.

dpkg lockLinux

E: Could not get lock /var/lib/dpkg/lock-frontend — is another process using it?

apt can’t run because another package operation (often automatic updates) holds the dpkg lock.

Sub-process /usr/bin/dpkg returned an error code (1)Linux

E: Sub-process /usr/bin/dpkg returned an error code (1)

A package’s install/configure script failed, so dpkg aborted. The real error is a few lines above this message.

dpkg was interruptedLinux

E: dpkg was interrupted, you must manually run 'sudo dpkg --configure -a' to correct the problem

A previous package operation stopped halfway (closed terminal, reboot, power loss), and apt refuses to continue until it’s finish…

Vite manifest not foundPHP

Laravel: Vite manifest not found at: public/build/manifest.json

Laravel’s @vite directive can’t find the compiled asset manifest because assets weren’t built.

Failed building wheelPython

error: subprocess-exited-with-error / Failed building wheel for x

pip had to compile a package from source and the build failed — missing compiler, headers or system libraries.

Prerender errorReact

Error occurred prerendering page "/x". Read more: https://nextjs.org/docs/messages/prerender-error

A page threw an error while Next.js was rendering it at build time.

ENOSPCDocker

no space left on device (Docker / Linux)

The disk (or inode table) is full — Docker images, build cache, logs and volumes are common culprits.

504HTTP

HTTP 504 Gateway Timeout

A proxy or gateway waited too long for the upstream server to respond and gave up.

524Cloudflare

Cloudflare Error 524: A Timeout Occurred

Cloudflare connected to the origin, but the origin didn’t send an HTTP response within 100 seconds.

react-scripts not foundReact

'react-scripts' is not recognized as an internal or external command / react-scripts: command not found

node_modules is missing or broken, so the react-scripts binary isn’t available.

Module parse failedReact

Module parse failed: Unexpected token. You may need an appropriate loader to handle this file type

Webpack found syntax it can’t parse because no loader is configured for that file (JSX, TypeScript, CSS, or modern syntax in node…

Text file busyLinux

Text file busy (ETXTBSY) when replacing or running a binary

You tried to overwrite an executable that is currently running, or run one that is still open for writing.

no matching manifestDocker

no matching manifest for linux/arm64/v8 in the manifest list entries

The image has no build for your CPU architecture — typically pulling an amd64-only image on an Apple Silicon Mac or ARM server.

conflict: unable to remove repository referenceDocker

conflict: unable to remove repository reference (must force) - container is using its referenced image

You tried to delete an image that a container — even a stopped one — still uses.

image has dependent child imagesDocker

conflict: unable to delete image (cannot be forced) - image has dependent child images

Other images were built on top of this one, so Docker won’t delete it by ID.