Error map

NETSDK1045 error NETSDK1045: The current .NET SDK does not support targeting .NET 8.0. Either target .NET 7.0 or lower, or use a version of the .NET SDK that supports .NET 8.0

.NET · layer 4, Application & API

Open the full error page →

Centre: this error. First ring: errors it is linked with (12). Outer ring: what those are linked with. Colours show the layer of a request each error belongs to. Click any dot to re-centre the map on it; hover to follow its connections. The centre dot opens the error page.

NETSDK1045 — error NETSDK1045: The current .NET SDK does not support targeting .NET 8.0. Either target .NET 7.0 or lower, or use a version of the .NET SDK that supports .NET 8.0 (.NET)NETSDK1045FileNotFoundException assembly — Could not load file or assembly 'X, Version=…' or one of its dependencies (.NET)FileNotFoundExcepti…lookup registry-1.docker.io: no such host — dial tcp: lookup registry-1.docker.io: no such host / Temporary failure in name resolution during docker build (Docker)lookup registry-1.d…Module parse failed — Module parse failed: Unexpected token. You may need an appropriate loader to handle this file type (React)Module parse faileddid not complete successfully — failed to solve: process "/bin/sh -c ..." did not complete successfully: exit code: 1 (Docker)did not complete su…unknown instruction — Dockerfile parse error line N: unknown instruction (Docker)unknown instructiongyp ERR! — gyp ERR! build error / node-gyp rebuild failed (npm)gyp ERR!COPY failed — COPY failed: file not found in build context / "/app/x": not found (Docker)COPY failedFailed building wheel — error: subprocess-exited-with-error / Failed building wheel for x (Python)Failed building whe…Prerender error — Error occurred prerendering page "/x". Read more: https://nextjs.org/docs/messages/prerender-error (React)Prerender errorDefaultAzureCredential failed — DefaultAzureCredential failed to retrieve a token from the included credentials / ManagedIdentityCredential authentication unavailable (Azure)DefaultAzureCredent…Output directory not found — Cloudflare Pages build: Error: Output directory "dist" not found / Failed: build output directory not found (Cloudflare)Output directory no…ELIFECYCLE — npm ERR! code ELIFECYCLE / Command failed with exit code 1 (npm)ELIFECYCLEClassNotFoundException — java.lang.ClassNotFoundException / NoClassDefFoundError (Java)ClassNotFoundExcept…500.30 — HTTP Error 500.30 - ASP.NET Core app failed to start (.NET)500.30MIME type not executable — Refused to execute script from 'x' because its MIME type ('text/html') is not executable (JavaScript)MIME type not execu…ECONNREFUSED — Error: connect ECONNREFUSED 127.0.0.1:5432 (Node.js)ECONNREFUSED408 — HTTP 408 Request Timeout (HTTP)408Failed to fetch — TypeError: Failed to fetch / NetworkError when attempting to fetch resource (JavaScript)Failed to fetchGradle wrapper main class — Error: Could not find or load main class org.gradle.wrapper.GradleWrapperMain (Java)Gradle wrapper main…ChunkLoadError — ChunkLoadError: Loading chunk 123 failed. (JavaScript)ChunkLoadErrorERR_OSSL_EVP_UNSUPPORTED — Error: error:0308010C:digital envelope routines::unsupported (Node.js)ERR_OSSL_EVP_UNSUPP…failed to read dockerfile — failed to solve: failed to read dockerfile: open Dockerfile: no such file or directory (Docker)failed to read dock…max depth exceeded — Error response from daemon: max depth exceeded (too many image layers) (Docker)max depth exceededforbidden path outside the build context — COPY failed: forbidden path outside the build context: ../file (Docker)forbidden path outs…Parse error — PHP Parse error: syntax error, unexpected … (PHP)Parse errorIndentationError — IndentationError: unexpected indent / expected an indented block (Python)IndentationErrorUnexpected token < — SyntaxError: Unexpected token '<' (HTML served instead of JavaScript) (JavaScript)Unexpected token <ModuleNotFoundError — ModuleNotFoundError: No module named 'x' (Python)ModuleNotFoundErrornode-sass — Error: Node Sass does not yet support your current environment (Node.js)node-sassNo Xcode or CLT — gyp: No Xcode or CLT version detected! (npm)No Xcode or CLTnot a git repository — fatal: not a git repository (or any of the parent directories): .git (Git)not a git repositoryENOENT — Error: ENOENT: no such file or directory (Node.js)ENOENTexec format error — exec /usr/local/bin/docker-entrypoint.sh: exec format error (Docker)exec format errorexternally-managed-environment — error: externally-managed-environment (Python)externally-managed-…pip no matching distribution — ERROR: Could not find a version that satisfies the requirement x (from versions: none) (Python)pip no matching dis…Sending build context — Docker build slow: "Sending build context to Docker daemon 2.5GB" / transferring context takes forever (Docker)Sending build conte…Hydration failed — Error: Hydration failed because the initial UI does not match what was rendered on the server (React)Hydration failedCan't resolve 'fs' — Module not found: Can't resolve 'fs' (Next.js / webpack 5) (React)Can't resolve 'fs'needs useState — You're importing a component that needs useState. It only works in a Client Component but none of its parents are marked with "use client" (React)needs useStatepublickey — Git: Permission denied (publickey). fatal: Could not read from remote repository. (Git)publickeyAADSTS700016 — Azure AD (Entra ID): AADSTS700016 Application not found in the directory (Azure)AADSTS700016invalid_grant — OAuth 2.0 Error: invalid_grant (Authentication)invalid_grantprisma generate — Error: @prisma/client did not initialize yet. Please run "prisma generate" (Node.js)prisma generateENOENT — npm ERR! enoent ENOENT: no such file or directory, open '/path/package.json' (npm)ENOENTVite manifest not found — Laravel: Vite manifest not found at: public/build/manifest.json (PHP)Vite manifest not f…EADDRINUSE — Error: listen EADDRINUSE: address already in use :::3000 (Node.js)EADDRINUSEOOMKilled — Kubernetes: OOMKilled (exit code 137) (Kubernetes)OOMKilledheap out of memory — FATAL ERROR: Reached heap limit Allocation failed - JavaScript heap out of memory (Node.js)heap out of memory

Directly related (12)

FileNotFoundException assembly.NET

Could not load file or assembly 'X, Version=…' or one of its dependencies

The runtime couldn’t find or load a referenced DLL — missing from the output, wrong version, or wrong platform (x86/x64).

lookup registry-1.docker.io: no such hostDocker

dial tcp: lookup registry-1.docker.io: no such host / Temporary failure in name resolution during docker build

DNS isn’t working for the Docker daemon or inside build containers, so pulls and package downloads fail.

Module parse failedReact

Module parse failed: Unexpected token. You may need an appropriate loader to handle this file type

Webpack found syntax it can’t parse because no loader is configured for that file (JSX, TypeScript, CSS, or modern syntax in node…

did not complete successfullyDocker

failed to solve: process "/bin/sh -c ..." did not complete successfully: exit code: 1

A RUN step in your Dockerfile failed. The real error is printed in the lines just above this message.

unknown instructionDocker

Dockerfile parse error line N: unknown instruction

A line in the Dockerfile doesn’t start with a valid instruction — usually a broken line continuation or a typo.

gyp ERR!npm

gyp ERR! build error / node-gyp rebuild failed

A dependency with native C/C++ code couldn’t compile — missing build tools, Python, or an unsupported Node version.

COPY failedDocker

COPY failed: file not found in build context / "/app/x": not found

The Dockerfile COPY refers to a path outside the build context, excluded by .dockerignore, or relative to the wrong directory.

Failed building wheelPython

error: subprocess-exited-with-error / Failed building wheel for x

pip had to compile a package from source and the build failed — missing compiler, headers or system libraries.

Prerender errorReact

Error occurred prerendering page "/x". Read more: https://nextjs.org/docs/messages/prerender-error

A page threw an error while Next.js was rendering it at build time.

DefaultAzureCredential failedAzure

DefaultAzureCredential failed to retrieve a token from the included credentials / ManagedIdentityCredential authentication unavailable

The Azure SDK tried every credential source (env vars, workload identity, managed identity, CLI…) and none worked.

Output directory not foundCloudflare

Cloudflare Pages build: Error: Output directory "dist" not found / Failed: build output directory not found

The Pages build finished, but the folder set as “Build output directory” doesn’t exist — the framework wrote its files somewhere…

ELIFECYCLEnpm

npm ERR! code ELIFECYCLE / Command failed with exit code 1

An npm script (build, start, test, postinstall) exited with an error. ELIFECYCLE is only the wrapper — the real error is printed…

Two steps away (36)

ClassNotFoundExceptionJava

java.lang.ClassNotFoundException / NoClassDefFoundError

The JVM couldn’t find a class on the classpath at runtime.

500.30.NET

HTTP Error 500.30 - ASP.NET Core app failed to start

IIS/Azure’s ASP.NET Core Module launched your app but it crashed during startup.

MIME type not executableJavaScript

Refused to execute script from 'x' because its MIME type ('text/html') is not executable

The browser fetched a script but the server labelled it text/html (usually an error page), so it refused to run it.

ECONNREFUSEDNode.js

Error: connect ECONNREFUSED 127.0.0.1:5432

Nothing is listening at that host:port — the target service is down or you’re connecting to the wrong address.

408HTTP

HTTP 408 Request Timeout

The server closed the connection because the client took too long to send the complete request.

Failed to fetchJavaScript

TypeError: Failed to fetch / NetworkError when attempting to fetch resource

The browser couldn’t complete the request at the network level — CORS, DNS, offline, blocked mixed content, or the server refused…

Gradle wrapper main classJava

Error: Could not find or load main class org.gradle.wrapper.GradleWrapperMain

The Gradle wrapper JAR (gradle/wrapper/gradle-wrapper.jar) is missing or corrupt.

ChunkLoadErrorJavaScript

ChunkLoadError: Loading chunk 123 failed.

A lazily loaded JavaScript chunk couldn’t be downloaded — usually because a new deployment removed the old hashed files.

ERR_OSSL_EVP_UNSUPPORTEDNode.js

Error: error:0308010C:digital envelope routines::unsupported

An old build tool (webpack 4, old react-scripts) uses a hash algorithm that OpenSSL 3 in Node 17+ disables.

failed to read dockerfileDocker

failed to solve: failed to read dockerfile: open Dockerfile: no such file or directory

docker build can’t find a Dockerfile in the build context you passed.

max depth exceededDocker

Error response from daemon: max depth exceeded (too many image layers)

The image has more layers than the storage driver allows (127 for overlay2), usually from repeatedly committing containers or ver…

forbidden path outside the build contextDocker

COPY failed: forbidden path outside the build context: ../file

A COPY/ADD tries to read a file above the build context (../something); Docker only sends the context folder to the builder.

Parse errorPHP

PHP Parse error: syntax error, unexpected …

PHP can’t parse the file because of a syntax mistake — the real error is often on the line before the one reported.

IndentationErrorPython

IndentationError: unexpected indent / expected an indented block

Python’s block structure is broken — inconsistent indentation or mixed tabs and spaces.

Unexpected token <JavaScript

SyntaxError: Unexpected token '<' (HTML served instead of JavaScript)

The browser loaded a .js file but received HTML (an error page or the SPA index.html).

ModuleNotFoundErrorPython

ModuleNotFoundError: No module named 'x'

Python can’t find the module you import — it isn’t installed in the interpreter/virtualenv that’s running, or the import path is…

node-sassNode.js

Error: Node Sass does not yet support your current environment

node-sass (deprecated) has no binary for your Node version/OS.

No Xcode or CLTnpm

gyp: No Xcode or CLT version detected!

node-gyp on macOS can’t find the Xcode Command Line Tools to compile native modules.

not a git repositoryGit

fatal: not a git repository (or any of the parent directories): .git

You ran a Git command outside a Git working tree.

ENOENTNode.js

Error: ENOENT: no such file or directory

A file or directory the program tried to open doesn’t exist at that path.

exec format errorDocker

exec /usr/local/bin/docker-entrypoint.sh: exec format error

The container tried to run a binary built for a different CPU architecture (arm64 vs amd64) — or a script with a broken shebang /…

externally-managed-environmentPython

error: externally-managed-environment

Your system Python (Debian 12+, Ubuntu 23.04+, Homebrew) refuses pip installs into the OS-managed environment (PEP 668).

pip no matching distributionPython

ERROR: Could not find a version that satisfies the requirement x (from versions: none)

pip found no installable version of the package for your Python version, OS or index.

Sending build contextDocker

Docker build slow: "Sending build context to Docker daemon 2.5GB" / transferring context takes forever

docker build is uploading your whole project folder — node_modules, .git, data files — before building, because there’s no (or a…

Hydration failedReact

Error: Hydration failed because the initial UI does not match what was rendered on the server

The HTML rendered on the server differs from the first client render, so React (Next.js/Remix) can’t attach to it.

Can't resolve 'fs'React

Module not found: Can't resolve 'fs' (Next.js / webpack 5)

A Node.js built-in (fs, path, crypto, net) is imported into code that runs in the browser bundle.

needs useStateReact

You're importing a component that needs useState. It only works in a Client Component but none of its parents are marked with "use client"

In the Next.js App Router, a component using hooks or browser APIs is rendered as a Server Component.

publickeyGit

Git: Permission denied (publickey). fatal: Could not read from remote repository.

SSH authentication to GitHub/GitLab/Bitbucket failed — no key, wrong key, or the key isn’t added to your account.

AADSTS700016Azure

Azure AD (Entra ID): AADSTS700016 Application not found in the directory

The client ID in your sign-in request doesn’t exist in the tenant you’re authenticating against.

invalid_grantAuthentication

OAuth 2.0 Error: invalid_grant

The authorization code, refresh token or credentials sent to the token endpoint are invalid, expired, already used or were issued…

prisma generateNode.js

Error: @prisma/client did not initialize yet. Please run "prisma generate"

The generated Prisma Client is missing or out of date.

ENOENTnpm

npm ERR! enoent ENOENT: no such file or directory, open '/path/package.json'

npm ran in a directory without a package.json.

Vite manifest not foundPHP

Laravel: Vite manifest not found at: public/build/manifest.json

Laravel’s @vite directive can’t find the compiled asset manifest because assets weren’t built.

EADDRINUSENode.js

Error: listen EADDRINUSE: address already in use :::3000

Another process is already listening on that port.

OOMKilledKubernetes

Kubernetes: OOMKilled (exit code 137)

The container used more memory than its limit, and the kernel killed it.

heap out of memoryNode.js

FATAL ERROR: Reached heap limit Allocation failed - JavaScript heap out of memory

The V8 heap hit its limit — a large build (webpack, tsc, Next.js) needs more memory, or the app leaks.