Error map

MIME type not executable Refused to execute script from 'x' because its MIME type ('text/html') is not executable

JavaScript · layer 1, On your device

Open the full error page →

Centre: this error. First ring: errors it is linked with (10). Outer ring: what those are linked with. Colours show the layer of a request each error belongs to. Click any dot to re-centre the map on it; hover to follow its connections. The centre dot opens the error page.

MIME type not executable — Refused to execute script from 'x' because its MIME type ('text/html') is not executable (JavaScript)MIME type n…FileNotFoundException assembly — Could not load file or assembly 'X, Version=…' or one of its dependencies (.NET)FileNotFoundExcepti…module MIME type — Failed to load module script: Expected a JavaScript module script but the server responded with a MIME type of "text/html" (JavaScript)module MIME typeUnexpected token < — SyntaxError: Unexpected token '<' (HTML served instead of JavaScript) (JavaScript)Unexpected token <ChunkLoadError — ChunkLoadError: Loading chunk 123 failed. (JavaScript)ChunkLoadErrorOPcache stale code — PHP still runs old code after deploy (OPcache not reset) (PHP)OPcache stale codeYou must install or update .NET to run this application — The framework 'Microsoft.NETCore.App', version '8.0.0' (x64) was not found. You must install or update .NET to run this application (.NET)You must install or…App Service Application Error — Azure App Service: ":( Application Error" / container didn’t respond to HTTP pings (Azure)App Service Applica…Refused to apply style from — Console: Refused to apply style from 'https://…/style.css' because its MIME type ('text/html') is not a supported stylesheet MIME type (Browser)Refused to apply st…Service worker registration failed — Console: Failed to register a ServiceWorker: A bad HTTP response code (404) was received when fetching the script (Browser)Service worker regi…DevTools failed to load source map — DevTools: Failed to load source map — Could not load content for https://…/app.js.map: HTTP error: status code 404 (Browser)DevTools failed to …ClassNotFoundException — java.lang.ClassNotFoundException / NoClassDefFoundError (Java)ClassNotFoundExcept…500.30 — HTTP Error 500.30 - ASP.NET Core app failed to start (.NET)500.30NETSDK1045 — error NETSDK1045: The current .NET SDK does not support targeting .NET 8.0. Either target .NET 7.0 or lower, or use a version of the .NET SDK that supports .NET 8.0 (.NET)NETSDK1045Failed to find a valid digest in the 'integrity' attribute — Console: Failed to find a valid digest in the 'integrity' attribute for resource … with computed SHA-256 integrity (Browser)Failed to find a va…SyntaxError: JSON — SyntaxError: Unexpected token < in JSON at position 0 (JavaScript)SyntaxError: JSONmissing ) — SyntaxError: missing ) after argument list (JavaScript)missing )already declared — SyntaxError: Identifier 'x' has already been declared (JavaScript)already declaredinvalid selector — DOMException: Failed to execute 'querySelector' on 'Document': 'x' is not a valid selector (JavaScript)invalid selectorCan't resolve 'fs' — Module not found: Can't resolve 'fs' (Next.js / webpack 5) (React)Can't resolve 'fs'Module parse failed — Module parse failed: Unexpected token. You may need an appropriate loader to handle this file type (React)Module parse failedPrimary script unknown — FastCGI sent in stderr: "Primary script unknown" (PHP)Primary script unkn…UnsupportedClassVersionError — java.lang.UnsupportedClassVersionError: class file version 61.0, this version of the Java Runtime only recognizes up to 55.0 (Java)UnsupportedClassVer…System.Drawing.Common is not supported — PlatformNotSupportedException: System.Drawing.Common is not supported on this platform (.NET)System.Drawing.Comm…CrashLoopBackOff — Kubernetes: CrashLoopBackOff (Kubernetes)CrashLoopBackOff502 — HTTP 502 Bad Gateway (HTTP)502No job functions found — Azure Functions: No job functions found. Try making your job classes and methods public / Error indexing method (Azure)No job functions fo…404 — HTTP 404 Not Found (HTTP)404Aw, Snap! — Chrome: Aw, Snap! Something went wrong while displaying this webpage. Error code: STATUS_ACCESS_VIOLATION / SIGILL / Out of Memory (Browser)Aw, Snap!The canvas has been tainted by cross-origin data — Console: SecurityError: Failed to execute 'toDataURL' / 'getImageData' on 'HTMLCanvasElement': Tainted canvases may not be exported (Browser)The canvas has been…captive portal — Browser: This network requires you to sign in — captive portal (hotel, airport, café Wi-Fi) blocking HTTPS sites (Browser)captive portalVersionError — Console: VersionError: The requested version (1) is less than the existing version (2) — IndexedDB open() failed (Browser)VersionErrorUnchecked runtime.lastError — Console: Unchecked runtime.lastError: The message port closed before a response was received (extension message) (Browser)Unchecked runtime.l…net::ERR_FAILED — Chrome DevTools: net::ERR_FAILED — a request failed with no specific reason (CORS, extension, mixed content or network) (Browser)net::ERR_FAILEDPage Unresponsive — Chrome: Page Unresponsive — The following page(s) have become unresponsive. You can wait for them to become responsive or exit the page(s) (Browser)Page Unresponsive$ is not defined — Console: Uncaught ReferenceError: $ is not defined (jQuery not loaded or loaded after your code) (Browser)$ is not defined

Directly related (10)

FileNotFoundException assembly.NET

Could not load file or assembly 'X, Version=…' or one of its dependencies

The runtime couldn’t find or load a referenced DLL — missing from the output, wrong version, or wrong platform (x86/x64).

module MIME typeJavaScript

Failed to load module script: Expected a JavaScript module script but the server responded with a MIME type of "text/html"

A or dynamic import got HTML back instead of JavaScript.

Unexpected token <JavaScript

SyntaxError: Unexpected token '<' (HTML served instead of JavaScript)

The browser loaded a .js file but received HTML (an error page or the SPA index.html).

ChunkLoadErrorJavaScript

ChunkLoadError: Loading chunk 123 failed.

A lazily loaded JavaScript chunk couldn’t be downloaded — usually because a new deployment removed the old hashed files.

OPcache stale codePHP

PHP still runs old code after deploy (OPcache not reset)

OPcache keeps serving cached bytecode, so changes uploaded to the server don’t take effect.

You must install or update .NET to run this application.NET

The framework 'Microsoft.NETCore.App', version '8.0.0' (x64) was not found. You must install or update .NET to run this application

The machine doesn’t have the .NET runtime version the app was built for (framework-dependent deployment).

App Service Application ErrorAzure

Azure App Service: ":( Application Error" / container didn’t respond to HTTP pings

App Service started your app but it crashed or never listened on the expected port.

Refused to apply style fromBrowser

Console: Refused to apply style from 'https://…/style.css' because its MIME type ('text/html') is not a supported stylesheet MIME type

The stylesheet URL returned something that is not CSS — usually a 404/HTML error page — and `X-Content-Type-Options: nosniff` mak…

Service worker registration failedBrowser

Console: Failed to register a ServiceWorker: A bad HTTP response code (404) was received when fetching the script

The browser could not fetch, parse or install the service worker script, or the page is not allowed to register one (HTTPS and sc…

DevTools failed to load source mapBrowser

DevTools: Failed to load source map — Could not load content for https://…/app.js.map: HTTP error: status code 404

DevTools could not download the `.map` file that a script or stylesheet points to, so you see minified code instead of your sourc…

Two steps away (25)

ClassNotFoundExceptionJava

java.lang.ClassNotFoundException / NoClassDefFoundError

The JVM couldn’t find a class on the classpath at runtime.

500.30.NET

HTTP Error 500.30 - ASP.NET Core app failed to start

IIS/Azure’s ASP.NET Core Module launched your app but it crashed during startup.

NETSDK1045.NET

error NETSDK1045: The current .NET SDK does not support targeting .NET 8.0. Either target .NET 7.0 or lower, or use a version of the .NET SDK that supports .NET 8.0

The installed .NET SDK is older than the project’s TargetFramework.

Failed to find a valid digest in the 'integrity' attributeBrowser

Console: Failed to find a valid digest in the 'integrity' attribute for resource … with computed SHA-256 integrity

A `` or `` with an `integrity` hash was blocked because the downloaded file does not match that hash.

SyntaxError: JSONJavaScript

SyntaxError: Unexpected token < in JSON at position 0

`JSON.parse()` / `response.json()` received something that isn’t JSON — very often an HTML error page.

missing )JavaScript

SyntaxError: missing ) after argument list

A function call’s parentheses are unbalanced — often an unescaped quote or a missing comma/plus.

already declaredJavaScript

SyntaxError: Identifier 'x' has already been declared

The same let/const/class name was declared twice in the same scope.

invalid selectorJavaScript

DOMException: Failed to execute 'querySelector' on 'Document': 'x' is not a valid selector

The CSS selector string is invalid — often an ID starting with a digit or containing special characters.

Can't resolve 'fs'React

Module not found: Can't resolve 'fs' (Next.js / webpack 5)

A Node.js built-in (fs, path, crypto, net) is imported into code that runs in the browser bundle.

Module parse failedReact

Module parse failed: Unexpected token. You may need an appropriate loader to handle this file type

Webpack found syntax it can’t parse because no loader is configured for that file (JSX, TypeScript, CSS, or modern syntax in node…

Primary script unknownPHP

FastCGI sent in stderr: "Primary script unknown"

Nginx passed a script path to PHP-FPM that PHP-FPM couldn’t find — usually a wrong SCRIPT_FILENAME or root.

UnsupportedClassVersionErrorJava

java.lang.UnsupportedClassVersionError: class file version 61.0, this version of the Java Runtime only recognizes up to 55.0

Code compiled for a newer Java version is running on an older JVM.

System.Drawing.Common is not supported.NET

PlatformNotSupportedException: System.Drawing.Common is not supported on this platform

Since .NET 6, System.Drawing.Common only works on Windows; on Linux/macOS (including Docker) it throws.

CrashLoopBackOffKubernetes

Kubernetes: CrashLoopBackOff

The container starts, crashes (or exits), and Kubernetes keeps restarting it with increasing back-off delays.

502HTTP

HTTP 502 Bad Gateway

A proxy or gateway (Nginx, load balancer, CDN) got an invalid response — or no response — from the upstream server behind it.

No job functions foundAzure

Azure Functions: No job functions found. Try making your job classes and methods public / Error indexing method

The Functions host started but couldn’t discover or index any functions — wrong project structure, extension/binding problems or…

404HTTP

HTTP 404 Not Found

The server can’t find anything at the requested URL.

Aw, Snap!Browser

Chrome: Aw, Snap! Something went wrong while displaying this webpage. Error code: STATUS_ACCESS_VIOLATION / SIGILL / Out of Memory

A Chrome tab crashed — out of memory, a faulty extension, a graphics/driver issue or a very heavy page.

The canvas has been tainted by cross-origin dataBrowser

Console: SecurityError: Failed to execute 'toDataURL' / 'getImageData' on 'HTMLCanvasElement': Tainted canvases may not be exported

You drew an image from another origin onto a canvas without CORS permission, so the browser blocks reading pixels back out.

captive portalBrowser

Browser: This network requires you to sign in — captive portal (hotel, airport, café Wi-Fi) blocking HTTPS sites

The Wi-Fi needs a login or acceptance page first; until you complete it, secure sites fail with certificate or connection errors.

VersionErrorBrowser

Console: VersionError: The requested version (1) is less than the existing version (2) — IndexedDB open() failed

`indexedDB.open(name, version)` was called with a lower version number than the database already has.

Unchecked runtime.lastErrorBrowser

Console: Unchecked runtime.lastError: The message port closed before a response was received (extension message)

A browser extension sent or received a message and the other side closed the channel without replying — almost always an extensio…

net::ERR_FAILEDBrowser

Chrome DevTools: net::ERR_FAILED — a request failed with no specific reason (CORS, extension, mixed content or network)

ERR_FAILED is Chrome’s catch-all for a failed request. In DevTools it very often hides a CORS rejection, an extension, or a block…

Page UnresponsiveBrowser

Chrome: Page Unresponsive — The following page(s) have become unresponsive. You can wait for them to become responsive or exit the page(s)

A tab is stuck in a busy loop or waiting on something heavy, so Chrome offers to wait or kill it.

$ is not definedBrowser

Console: Uncaught ReferenceError: $ is not defined (jQuery not loaded or loaded after your code)

Your code uses jQuery's `$` before jQuery has loaded — the script is missing, blocked, in the wrong order, or loaded `async`/`def…