Error map

Failed to find a valid digest in the 'integrity' attribute Console: Failed to find a valid digest in the 'integrity' attribute for resource … with computed SHA-256 integrity

Browser · layer 1, On your device

Open the full error page →

Centre: this error. First ring: errors it is linked with (7). Outer ring: what those are linked with. Colours show the layer of a request each error belongs to. Click any dot to re-centre the map on it; hover to follow its connections. The centre dot opens the error page.

Failed to find a valid digest in the 'integrity' attribute — Console: Failed to find a valid digest in the 'integrity' attribute for resource … with computed SHA-256 integrity (Browser)Failed to f…module MIME type — Failed to load module script: Expected a JavaScript module script but the server responded with a MIME type of "text/html" (JavaScript)module MIME typeCSP violation — Refused to load the script because it violates the following Content Security Policy directive (JavaScript)CSP violationBadDigest — Upload error: checksum mismatch (BadDigest / Content-MD5 did not match / XAmzContentSHA256Mismatch) (API)BadDigestcf-cache-status: DYNAMIC — Cloudflare not caching: cf-cache-status DYNAMIC / BYPASS / MISS every time (Cloudflare)cf-cache-status: DY…Aw, Snap! — Chrome: Aw, Snap! Something went wrong while displaying this webpage. Error code: STATUS_ACCESS_VIOLATION / SIGILL / Out of Memory (Browser)Aw, Snap!Refused to apply style from — Console: Refused to apply style from 'https://…/style.css' because its MIME type ('text/html') is not a supported stylesheet MIME type (Browser)Refused to apply st…DevTools failed to load source map — DevTools: Failed to load source map — Could not load content for https://…/app.js.map: HTTP error: status code 404 (Browser)DevTools failed to …App Service Application Error — Azure App Service: ":( Application Error" / container didn’t respond to HTTP pings (Azure)App Service Applica…FileNotFoundException assembly — Could not load file or assembly 'X, Version=…' or one of its dependencies (.NET)FileNotFoundExcepti…Unexpected token < — SyntaxError: Unexpected token '<' (HTML served instead of JavaScript) (JavaScript)Unexpected token <Headers already sent — Warning: Cannot modify header information - headers already sent (PHP)Headers already sentCORS — CORS Error: No 'Access-Control-Allow-Origin' header is present (API)CORS411 — HTTP 411 Length Required (HTTP)411EINTEGRITY — npm ERR! code EINTEGRITY — sha512 integrity checksum failed (npm)EINTEGRITYLink expired — WordPress: The link you followed has expired (WordPress)Link expiredconcurrent_requests_limit — API Error: Too many concurrent requests (concurrency limit reached) (API)concurrent_requests…504 — HTTP 504 Gateway Timeout (HTTP)504524 — Cloudflare Error 524: A Timeout Occurred (Cloudflare)524304 — HTTP 304 Not Modified (HTTP)304MEMORY_MANAGEMENT — Blue Screen: MEMORY_MANAGEMENT (Stop code 0x0000001A) (Windows)MEMORY_MANAGEMENTinvalid array length — RangeError: Invalid array length (JavaScript)invalid array lengthERR_CONTENT_DECODING_FAILED — Chrome: This page isn’t working — sent an invalid response. ERR_CONTENT_DECODING_FAILED (Browser)ERR_CONTENT_DECODIN…404 — HTTP 404 Not Found (HTTP)404MIME type not executable — Refused to execute script from 'x' because its MIME type ('text/html') is not executable (JavaScript)MIME type not execu…The canvas has been tainted by cross-origin data — Console: SecurityError: Failed to execute 'toDataURL' / 'getImageData' on 'HTMLCanvasElement': Tainted canvases may not be exported (Browser)The canvas has been…ChunkLoadError — ChunkLoadError: Loading chunk 123 failed. (JavaScript)ChunkLoadErrorModule parse failed — Module parse failed: Unexpected token. You may need an appropriate loader to handle this file type (React)Module parse failednet::ERR_FAILED — Chrome DevTools: net::ERR_FAILED — a request failed with no specific reason (CORS, extension, mixed content or network) (Browser)net::ERR_FAILED

Directly related (7)

module MIME typeJavaScript

Failed to load module script: Expected a JavaScript module script but the server responded with a MIME type of "text/html"

A or dynamic import got HTML back instead of JavaScript.

CSP violationJavaScript

Refused to load the script because it violates the following Content Security Policy directive

The page’s Content-Security-Policy doesn’t allow that script, style, image or connection source.

BadDigestAPI

Upload error: checksum mismatch (BadDigest / Content-MD5 did not match / XAmzContentSHA256Mismatch)

The server computed a different checksum for the data it received than the one your client declared, so it rejected the upload as…

cf-cache-status: DYNAMICCloudflare

Cloudflare not caching: cf-cache-status DYNAMIC / BYPASS / MISS every time

Cloudflare isn’t caching the response — HTML isn’t cached by default, and cookies or Cache-Control headers from the origin preven…

Aw, Snap!Browser

Chrome: Aw, Snap! Something went wrong while displaying this webpage. Error code: STATUS_ACCESS_VIOLATION / SIGILL / Out of Memory

A Chrome tab crashed — out of memory, a faulty extension, a graphics/driver issue or a very heavy page.

Refused to apply style fromBrowser

Console: Refused to apply style from 'https://…/style.css' because its MIME type ('text/html') is not a supported stylesheet MIME type

The stylesheet URL returned something that is not CSS — usually a 404/HTML error page — and `X-Content-Type-Options: nosniff` mak…

DevTools failed to load source mapBrowser

DevTools: Failed to load source map — Could not load content for https://…/app.js.map: HTTP error: status code 404

DevTools could not download the `.map` file that a script or stylesheet points to, so you see minified code instead of your sourc…

Two steps away (21)

App Service Application ErrorAzure

Azure App Service: ":( Application Error" / container didn’t respond to HTTP pings

App Service started your app but it crashed or never listened on the expected port.

FileNotFoundException assembly.NET

Could not load file or assembly 'X, Version=…' or one of its dependencies

The runtime couldn’t find or load a referenced DLL — missing from the output, wrong version, or wrong platform (x86/x64).

Unexpected token <JavaScript

SyntaxError: Unexpected token '<' (HTML served instead of JavaScript)

The browser loaded a .js file but received HTML (an error page or the SPA index.html).

Headers already sentPHP

Warning: Cannot modify header information - headers already sent

You called `header()`, `setcookie()` or `session_start()` after output had already been sent to the browser.

CORSAPI

CORS Error: No 'Access-Control-Allow-Origin' header is present

The browser blocked a cross-origin request because the server’s response didn’t include the CORS headers allowing your site’s ori…

411HTTP

HTTP 411 Length Required

The server refuses a request with a body but no Content-Length header.

EINTEGRITYnpm

npm ERR! code EINTEGRITY — sha512 integrity checksum failed

A downloaded package’s hash doesn’t match the integrity value in package-lock.json — a corrupted cache, a changed tarball, or a l…

Link expiredWordPress

WordPress: The link you followed has expired

Usually an upload (theme, plugin, media) larger than PHP’s upload/post limits — WordPress receives an empty request and shows thi…

concurrent_requests_limitAPI

API Error: Too many concurrent requests (concurrency limit reached)

You have more requests in flight at once than the API allows for your key — even if your requests-per-minute rate is fine.

504HTTP

HTTP 504 Gateway Timeout

A proxy or gateway waited too long for the upstream server to respond and gave up.

524Cloudflare

Cloudflare Error 524: A Timeout Occurred

Cloudflare connected to the origin, but the origin didn’t send an HTTP response within 100 seconds.

304HTTP

HTTP 304 Not Modified

The cached copy is still valid, so the server sends no body and the client reuses its cache.

MEMORY_MANAGEMENTWindows

Blue Screen: MEMORY_MANAGEMENT (Stop code 0x0000001A)

Windows detected a severe memory-management error — commonly faulty RAM, unstable memory settings or a bad driver.

invalid array lengthJavaScript

RangeError: Invalid array length

An array was created or resized with a negative, fractional or enormous length.

ERR_CONTENT_DECODING_FAILEDBrowser

Chrome: This page isn’t working — sent an invalid response. ERR_CONTENT_DECODING_FAILED

The response claims to be compressed (gzip/brotli) but cannot be decompressed — it was double-compressed, truncated or not compre…

404HTTP

HTTP 404 Not Found

The server can’t find anything at the requested URL.

MIME type not executableJavaScript

Refused to execute script from 'x' because its MIME type ('text/html') is not executable

The browser fetched a script but the server labelled it text/html (usually an error page), so it refused to run it.

The canvas has been tainted by cross-origin dataBrowser

Console: SecurityError: Failed to execute 'toDataURL' / 'getImageData' on 'HTMLCanvasElement': Tainted canvases may not be exported

You drew an image from another origin onto a canvas without CORS permission, so the browser blocks reading pixels back out.

ChunkLoadErrorJavaScript

ChunkLoadError: Loading chunk 123 failed.

A lazily loaded JavaScript chunk couldn’t be downloaded — usually because a new deployment removed the old hashed files.

Module parse failedReact

Module parse failed: Unexpected token. You may need an appropriate loader to handle this file type

Webpack found syntax it can’t parse because no loader is configured for that file (JSX, TypeScript, CSS, or modern syntax in node…

net::ERR_FAILEDBrowser

Chrome DevTools: net::ERR_FAILED — a request failed with no specific reason (CORS, extension, mixed content or network)

ERR_FAILED is Chrome’s catch-all for a failed request. In DevTools it very often hides a CORS rejection, an extension, or a block…