Error map

Unexpected token < SyntaxError: Unexpected token '<' (HTML served instead of JavaScript)

JavaScript · layer 1, On your device

Open the full error page →

Centre: this error. First ring: errors it is linked with (12). Outer ring: what those are linked with. Colours show the layer of a request each error belongs to. Click any dot to re-centre the map on it; hover to follow its connections. The centre dot opens the error page.

Unexpected token < — SyntaxError: Unexpected token '<' (HTML served instead of JavaScript) (JavaScript)Unexpected …module MIME type — Failed to load module script: Expected a JavaScript module script but the server responded with a MIME type of "text/html" (JavaScript)module MIME typeunknown instruction — Dockerfile parse error line N: unknown instruction (Docker)unknown instructioninvalid regex — SyntaxError: Invalid regular expression: /x/: Unterminated group (JavaScript)invalid regexSyntaxError: JSON — SyntaxError: Unexpected token < in JSON at position 0 (JavaScript)SyntaxError: JSONawait outside async — SyntaxError: await is only valid in async functions and the top level bodies of modules (JavaScript)await outside asyncunexpected identifier — SyntaxError: Unexpected identifier (JavaScript)unexpected identifi…invalid token — SyntaxError: Invalid or unexpected token (JavaScript)invalid tokenChunkLoadError — ChunkLoadError: Loading chunk 123 failed. (JavaScript)ChunkLoadErrorOPcache stale code — PHP still runs old code after deploy (OPcache not reset) (PHP)OPcache stale codeGraphQL Syntax Error — GraphQL: Syntax Error: Expected Name, found <EOF> / Unexpected } (API)GraphQL Syntax Errormissing ) — SyntaxError: missing ) after argument list (JavaScript)missing )already declared — SyntaxError: Identifier 'x' has already been declared (JavaScript)already declaredApp Service Application Error — Azure App Service: ":( Application Error" / container didn’t respond to HTTP pings (Azure)App Service Applica…FileNotFoundException assembly — Could not load file or assembly 'X, Version=…' or one of its dependencies (.NET)FileNotFoundExcepti…MIME type not executable — Refused to execute script from 'x' because its MIME type ('text/html') is not executable (JavaScript)MIME type not execu…Parse error — PHP Parse error: syntax error, unexpected … (PHP)Parse errorIndentationError — IndentationError: unexpected indent / expected an indented block (Python)IndentationErrorELIFECYCLE — npm ERR! code ELIFECYCLE / Command failed with exit code 1 (npm)ELIFECYCLEunexpected end of input — SyntaxError: Unexpected end of input (JavaScript)unexpected end of i…SyntaxError — SyntaxError: invalid syntax (Python)SyntaxErrorAdjacent JSX elements — Adjacent JSX elements must be wrapped in an enclosing tag. Did you want a JSX fragment <>...</>? (React)Adjacent JSX elemen…400 — HTTP 400 Bad Request (HTTP)400404 — HTTP 404 Not Found (HTTP)404500 — HTTP 500 Internal Server Error (HTTP)500UnhandledPromiseRejection — Node.js: [UnhandledPromiseRejection] — This error originated either by throwing inside of an async function without a catch block (Node.js)UnhandledPromiseRej…AbortError — AbortError: The user aborted a request. / signal is aborted without reason (JavaScript)AbortErrorbody already used — TypeError: Failed to execute 'json' on 'Response': body stream already read (JavaScript)body already usedinvalid selector — DOMException: Failed to execute 'querySelector' on 'Document': 'x' is not a valid selector (JavaScript)invalid selectorCan't resolve 'fs' — Module not found: Can't resolve 'fs' (Next.js / webpack 5) (React)Can't resolve 'fs'Module parse failed — Module parse failed: Unexpected token. You may need an appropriate loader to handle this file type (React)Module parse failedPrimary script unknown — FastCGI sent in stderr: "Primary script unknown" (PHP)Primary script unkn…You must install or update .NET to run this application — The framework 'Microsoft.NETCore.App', version '8.0.0' (x64) was not found. You must install or update .NET to run this application (.NET)You must install or…GRAPHQL_VALIDATION_FAILED — GraphQL: Cannot query field "x" on type "Y" (API)GRAPHQL_VALIDATION_…entity.parse.failed — API Error: Malformed JSON in request body (entity.parse.failed / JSON parse error) (API)entity.parse.failedVariable of required type was not provided — GraphQL: Variable "$id" of required type "ID!" was not provided. (API)Variable of require…ReferenceError — ReferenceError: x is not defined (JavaScript)ReferenceErrorNameError — NameError: name 'x' is not defined (Python)NameErrorTDZ — ReferenceError: Cannot access 'x' before initialization (JavaScript)TDZ

Directly related (12)

module MIME typeJavaScript

Failed to load module script: Expected a JavaScript module script but the server responded with a MIME type of "text/html"

A or dynamic import got HTML back instead of JavaScript.

unknown instructionDocker

Dockerfile parse error line N: unknown instruction

A line in the Dockerfile doesn’t start with a valid instruction — usually a broken line continuation or a typo.

invalid regexJavaScript

SyntaxError: Invalid regular expression: /x/: Unterminated group

A regex pattern has invalid syntax — unbalanced parentheses/brackets or unescaped special characters.

SyntaxError: JSONJavaScript

SyntaxError: Unexpected token < in JSON at position 0

`JSON.parse()` / `response.json()` received something that isn’t JSON — very often an HTML error page.

await outside asyncJavaScript

SyntaxError: await is only valid in async functions and the top level bodies of modules

await was used inside a function that isn’t async (or in a classic, non-module script).

unexpected identifierJavaScript

SyntaxError: Unexpected identifier

The parser found a name where it expected punctuation — usually a missing comma, operator or quote.

invalid tokenJavaScript

SyntaxError: Invalid or unexpected token

The code contains a character the parser can’t handle — smart quotes, stray characters or an unterminated string.

ChunkLoadErrorJavaScript

ChunkLoadError: Loading chunk 123 failed.

A lazily loaded JavaScript chunk couldn’t be downloaded — usually because a new deployment removed the old hashed files.

OPcache stale codePHP

PHP still runs old code after deploy (OPcache not reset)

OPcache keeps serving cached bytecode, so changes uploaded to the server don’t take effect.

GraphQL Syntax ErrorAPI

GraphQL: Syntax Error: Expected Name, found <EOF> / Unexpected }

The GraphQL document is malformed — unbalanced braces, a stray comma/character, or an empty query.

missing )JavaScript

SyntaxError: missing ) after argument list

A function call’s parentheses are unbalanced — often an unescaped quote or a missing comma/plus.

already declaredJavaScript

SyntaxError: Identifier 'x' has already been declared

The same let/const/class name was declared twice in the same scope.

Two steps away (26)

App Service Application ErrorAzure

Azure App Service: ":( Application Error" / container didn’t respond to HTTP pings

App Service started your app but it crashed or never listened on the expected port.

FileNotFoundException assembly.NET

Could not load file or assembly 'X, Version=…' or one of its dependencies

The runtime couldn’t find or load a referenced DLL — missing from the output, wrong version, or wrong platform (x86/x64).

MIME type not executableJavaScript

Refused to execute script from 'x' because its MIME type ('text/html') is not executable

The browser fetched a script but the server labelled it text/html (usually an error page), so it refused to run it.

Parse errorPHP

PHP Parse error: syntax error, unexpected …

PHP can’t parse the file because of a syntax mistake — the real error is often on the line before the one reported.

IndentationErrorPython

IndentationError: unexpected indent / expected an indented block

Python’s block structure is broken — inconsistent indentation or mixed tabs and spaces.

ELIFECYCLEnpm

npm ERR! code ELIFECYCLE / Command failed with exit code 1

An npm script (build, start, test, postinstall) exited with an error. ELIFECYCLE is only the wrapper — the real error is printed…

unexpected end of inputJavaScript

SyntaxError: Unexpected end of input

The parser reached the end of the code (or JSON) while still expecting more — a missing } ) ] or empty JSON.

SyntaxErrorPython

SyntaxError: invalid syntax

Python couldn’t parse the code. The caret (^) points at or just after the mistake.

Adjacent JSX elementsReact

Adjacent JSX elements must be wrapped in an enclosing tag. Did you want a JSX fragment <>...</>?

A component returns two sibling JSX elements without a single parent.

400HTTP

HTTP 400 Bad Request

The server could not understand the request because its syntax, headers or body are malformed or invalid.

404HTTP

HTTP 404 Not Found

The server can’t find anything at the requested URL.

500HTTP

HTTP 500 Internal Server Error

The server hit an unexpected condition — usually an unhandled exception or misconfiguration in the application.

UnhandledPromiseRejectionNode.js

Node.js: [UnhandledPromiseRejection] — This error originated either by throwing inside of an async function without a catch block

A promise rejected and nothing handled it; since Node 15 this crashes the process.

AbortErrorJavaScript

AbortError: The user aborted a request. / signal is aborted without reason

A fetch was cancelled through an AbortController (or the browser cancelled it).

body already usedJavaScript

TypeError: Failed to execute 'json' on 'Response': body stream already read

A fetch Response body was consumed twice (e.g. calling .text() then .json()).

invalid selectorJavaScript

DOMException: Failed to execute 'querySelector' on 'Document': 'x' is not a valid selector

The CSS selector string is invalid — often an ID starting with a digit or containing special characters.

Can't resolve 'fs'React

Module not found: Can't resolve 'fs' (Next.js / webpack 5)

A Node.js built-in (fs, path, crypto, net) is imported into code that runs in the browser bundle.

Module parse failedReact

Module parse failed: Unexpected token. You may need an appropriate loader to handle this file type

Webpack found syntax it can’t parse because no loader is configured for that file (JSX, TypeScript, CSS, or modern syntax in node…

Primary script unknownPHP

FastCGI sent in stderr: "Primary script unknown"

Nginx passed a script path to PHP-FPM that PHP-FPM couldn’t find — usually a wrong SCRIPT_FILENAME or root.

You must install or update .NET to run this application.NET

The framework 'Microsoft.NETCore.App', version '8.0.0' (x64) was not found. You must install or update .NET to run this application

The machine doesn’t have the .NET runtime version the app was built for (framework-dependent deployment).

GRAPHQL_VALIDATION_FAILEDAPI

GraphQL: Cannot query field "x" on type "Y"

The query asks for a field that doesn’t exist in the server’s schema (or isn’t available on that type).

entity.parse.failedAPI

API Error: Malformed JSON in request body (entity.parse.failed / JSON parse error)

The server couldn’t parse the request body as JSON, so it rejected the request before looking at any field.

Variable of required type was not providedAPI

GraphQL: Variable "$id" of required type "ID!" was not provided.

A GraphQL operation declares a non-null variable, but the request didn’t include a value for it.

ReferenceErrorJavaScript

ReferenceError: x is not defined

Code refers to a variable or function name that doesn’t exist in the current scope.

NameErrorPython

NameError: name 'x' is not defined

Python doesn’t know the name — it was never assigned/imported in this scope, or it’s misspelled.

TDZJavaScript

ReferenceError: Cannot access 'x' before initialization

A let/const/class was used before its declaration line ran (temporal dead zone) — often a circular import.