Error map

invalid regex SyntaxError: Invalid regular expression: /x/: Unterminated group

JavaScript · layer 1, On your device

Open the full error page →

Centre: this error. First ring: errors it is linked with (12). Outer ring: what those are linked with. Colours show the layer of a request each error belongs to. Click any dot to re-centre the map on it; hover to follow its connections. The centre dot opens the error page.

invalid regex — SyntaxError: Invalid regular expression: /x/: Unterminated group (JavaScript)invalid reg…SyntaxError — SyntaxError: invalid syntax (Python)SyntaxErrorunknown instruction — Dockerfile parse error line N: unknown instruction (Docker)unknown instructionunexpected end of input — SyntaxError: Unexpected end of input (JavaScript)unexpected end of i…Unexpected token < — SyntaxError: Unexpected token '<' (HTML served instead of JavaScript) (JavaScript)Unexpected token <await outside async — SyntaxError: await is only valid in async functions and the top level bodies of modules (JavaScript)await outside asyncunexpected identifier — SyntaxError: Unexpected identifier (JavaScript)unexpected identifi…invalid token — SyntaxError: Invalid or unexpected token (JavaScript)invalid tokenAdjacent JSX elements — Adjacent JSX elements must be wrapped in an enclosing tag. Did you want a JSX fragment <>...</>? (React)Adjacent JSX elemen…GraphQL Syntax Error — GraphQL: Syntax Error: Expected Name, found <EOF> / Unexpected } (API)GraphQL Syntax ErrorIndentationError — IndentationError: unexpected indent / expected an indented block (Python)IndentationErrormissing ) — SyntaxError: missing ) after argument list (JavaScript)missing )already declared — SyntaxError: Identifier 'x' has already been declared (JavaScript)already declaredParse error — PHP Parse error: syntax error, unexpected … (PHP)Parse errorELIFECYCLE — npm ERR! code ELIFECYCLE / Command failed with exit code 1 (npm)ELIFECYCLEgyp ERR! — gyp ERR! build error / node-gyp rebuild failed (npm)gyp ERR!COPY failed — COPY failed: file not found in build context / "/app/x": not found (Docker)COPY failedSyntaxError: JSON — SyntaxError: Unexpected token < in JSON at position 0 (JavaScript)SyntaxError: JSONMismatchedInputException — com.fasterxml.jackson.databind.exc.MismatchedInputException: Cannot deserialize value of type `java.util.ArrayList` from Object value (Java)MismatchedInputExce…UnrecognizedPropertyException — com.fasterxml.jackson.databind.exc.UnrecognizedPropertyException: Unrecognized field "x", not marked as ignorable (Java)UnrecognizedPropert…MIME type not executable — Refused to execute script from 'x' because its MIME type ('text/html') is not executable (JavaScript)MIME type not execu…ChunkLoadError — ChunkLoadError: Loading chunk 123 failed. (JavaScript)ChunkLoadErrormodule MIME type — Failed to load module script: Expected a JavaScript module script but the server responded with a MIME type of "text/html" (JavaScript)module MIME typeUnhandledPromiseRejection — Node.js: [UnhandledPromiseRejection] — This error originated either by throwing inside of an async function without a catch block (Node.js)UnhandledPromiseRej…AbortError — AbortError: The user aborted a request. / signal is aborted without reason (JavaScript)AbortErrorbody already used — TypeError: Failed to execute 'json' on 'Response': body stream already read (JavaScript)body already usedObjects are not valid as a React child — Error: Objects are not valid as a React child (React)Objects are not val…Nothing was returned from render — Error: Nothing was returned from render. This usually means a return statement is missing. (React)Nothing was returne…React must be in scope — ReferenceError: React is not defined / 'React' must be in scope when using JSX (React)React must be in sc…GRAPHQL_VALIDATION_FAILED — GraphQL: Cannot query field "x" on type "Y" (API)GRAPHQL_VALIDATION_…entity.parse.failed — API Error: Malformed JSON in request body (entity.parse.failed / JSON parse error) (API)entity.parse.failedVariable of required type was not provided — GraphQL: Variable "$id" of required type "ID!" was not provided. (API)Variable of require…NameError — NameError: name 'x' is not defined (Python)NameErrorcompose validation — docker compose: services.x Additional property y is not allowed / yaml: line N: mapping values are not allowed (Docker)compose validationReferenceError — ReferenceError: x is not defined (JavaScript)ReferenceErrorTDZ — ReferenceError: Cannot access 'x' before initialization (JavaScript)TDZUnboundLocalError — UnboundLocalError: cannot access local variable 'x' where it is not associated with a value (Python)UnboundLocalError

Directly related (12)

SyntaxErrorPython

SyntaxError: invalid syntax

Python couldn’t parse the code. The caret (^) points at or just after the mistake.

unknown instructionDocker

Dockerfile parse error line N: unknown instruction

A line in the Dockerfile doesn’t start with a valid instruction — usually a broken line continuation or a typo.

unexpected end of inputJavaScript

SyntaxError: Unexpected end of input

The parser reached the end of the code (or JSON) while still expecting more — a missing } ) ] or empty JSON.

Unexpected token <JavaScript

SyntaxError: Unexpected token '<' (HTML served instead of JavaScript)

The browser loaded a .js file but received HTML (an error page or the SPA index.html).

await outside asyncJavaScript

SyntaxError: await is only valid in async functions and the top level bodies of modules

await was used inside a function that isn’t async (or in a classic, non-module script).

unexpected identifierJavaScript

SyntaxError: Unexpected identifier

The parser found a name where it expected punctuation — usually a missing comma, operator or quote.

invalid tokenJavaScript

SyntaxError: Invalid or unexpected token

The code contains a character the parser can’t handle — smart quotes, stray characters or an unterminated string.

Adjacent JSX elementsReact

Adjacent JSX elements must be wrapped in an enclosing tag. Did you want a JSX fragment <>...</>?

A component returns two sibling JSX elements without a single parent.

GraphQL Syntax ErrorAPI

GraphQL: Syntax Error: Expected Name, found <EOF> / Unexpected }

The GraphQL document is malformed — unbalanced braces, a stray comma/character, or an empty query.

IndentationErrorPython

IndentationError: unexpected indent / expected an indented block

Python’s block structure is broken — inconsistent indentation or mixed tabs and spaces.

missing )JavaScript

SyntaxError: missing ) after argument list

A function call’s parentheses are unbalanced — often an unescaped quote or a missing comma/plus.

already declaredJavaScript

SyntaxError: Identifier 'x' has already been declared

The same let/const/class name was declared twice in the same scope.

Two steps away (24)

Parse errorPHP

PHP Parse error: syntax error, unexpected …

PHP can’t parse the file because of a syntax mistake — the real error is often on the line before the one reported.

ELIFECYCLEnpm

npm ERR! code ELIFECYCLE / Command failed with exit code 1

An npm script (build, start, test, postinstall) exited with an error. ELIFECYCLE is only the wrapper — the real error is printed…

gyp ERR!npm

gyp ERR! build error / node-gyp rebuild failed

A dependency with native C/C++ code couldn’t compile — missing build tools, Python, or an unsupported Node version.

COPY failedDocker

COPY failed: file not found in build context / "/app/x": not found

The Dockerfile COPY refers to a path outside the build context, excluded by .dockerignore, or relative to the wrong directory.

SyntaxError: JSONJavaScript

SyntaxError: Unexpected token < in JSON at position 0

`JSON.parse()` / `response.json()` received something that isn’t JSON — very often an HTML error page.

MismatchedInputExceptionJava

com.fasterxml.jackson.databind.exc.MismatchedInputException: Cannot deserialize value of type `java.util.ArrayList` from Object value

Jackson found JSON whose shape doesn’t match the target Java type (object vs array, string vs number, missing constructor).

UnrecognizedPropertyExceptionJava

com.fasterxml.jackson.databind.exc.UnrecognizedPropertyException: Unrecognized field "x", not marked as ignorable

The JSON contains a field your Java class doesn’t have, and Jackson is configured to fail on unknown properties.

MIME type not executableJavaScript

Refused to execute script from 'x' because its MIME type ('text/html') is not executable

The browser fetched a script but the server labelled it text/html (usually an error page), so it refused to run it.

ChunkLoadErrorJavaScript

ChunkLoadError: Loading chunk 123 failed.

A lazily loaded JavaScript chunk couldn’t be downloaded — usually because a new deployment removed the old hashed files.

module MIME typeJavaScript

Failed to load module script: Expected a JavaScript module script but the server responded with a MIME type of "text/html"

A or dynamic import got HTML back instead of JavaScript.

UnhandledPromiseRejectionNode.js

Node.js: [UnhandledPromiseRejection] — This error originated either by throwing inside of an async function without a catch block

A promise rejected and nothing handled it; since Node 15 this crashes the process.

AbortErrorJavaScript

AbortError: The user aborted a request. / signal is aborted without reason

A fetch was cancelled through an AbortController (or the browser cancelled it).

body already usedJavaScript

TypeError: Failed to execute 'json' on 'Response': body stream already read

A fetch Response body was consumed twice (e.g. calling .text() then .json()).

Objects are not valid as a React childReact

Error: Objects are not valid as a React child

You tried to render a plain object (or a Promise/Date) directly in JSX; React can only render strings, numbers, elements and arra…

Nothing was returned from renderReact

Error: Nothing was returned from render. This usually means a return statement is missing.

A component returned undefined (React 17 and earlier) — usually a missing return or a return followed by a line break.

React must be in scopeReact

ReferenceError: React is not defined / 'React' must be in scope when using JSX

JSX was compiled with the classic runtime, which needs React imported in every file.

GRAPHQL_VALIDATION_FAILEDAPI

GraphQL: Cannot query field "x" on type "Y"

The query asks for a field that doesn’t exist in the server’s schema (or isn’t available on that type).

entity.parse.failedAPI

API Error: Malformed JSON in request body (entity.parse.failed / JSON parse error)

The server couldn’t parse the request body as JSON, so it rejected the request before looking at any field.

Variable of required type was not providedAPI

GraphQL: Variable "$id" of required type "ID!" was not provided.

A GraphQL operation declares a non-null variable, but the request didn’t include a value for it.

NameErrorPython

NameError: name 'x' is not defined

Python doesn’t know the name — it was never assigned/imported in this scope, or it’s misspelled.

compose validationDocker

docker compose: services.x Additional property y is not allowed / yaml: line N: mapping values are not allowed

The compose file is invalid YAML or uses a key Compose doesn’t recognise at that level (usually an indentation mistake).

ReferenceErrorJavaScript

ReferenceError: x is not defined

Code refers to a variable or function name that doesn’t exist in the current scope.

TDZJavaScript

ReferenceError: Cannot access 'x' before initialization

A let/const/class was used before its declaration line ran (temporal dead zone) — often a circular import.

UnboundLocalErrorPython

UnboundLocalError: cannot access local variable 'x' where it is not associated with a value

A function assigns to a variable somewhere, which makes it local everywhere in that function — so reading it before the assignmen…