Error map
TypeError TypeError: Cannot read properties of undefined (reading 'x')
JavaScript · layer 1, On your device
Centre: this error. First ring: errors it is linked with (12). Outer ring: what those are linked with. Colours show the layer of a request each error belongs to. Click any dot to re-centre the map on it; hover to follow its connections. The centre dot opens the error page.
Directly related (12)
java.lang.NullPointerException
Code called a method or accessed a field on a reference that is `null`.
Warning: Undefined array key / Undefined index
Your code reads an array key that doesn’t exist — common with `$_GET`, `$_POST` and decoded JSON.
System.NullReferenceException: Object reference not set to an instance of an object
Code dereferenced a variable that is `null` — the .NET equivalent of Java’s NullPointerException.
ReferenceError: x is not defined
Code refers to a variable or function name that doesn’t exist in the current scope.
TypeError: 'NoneType' object is not subscriptable
You used `[ ]` on a value that is `None` — typically a function that returned nothing.
Error: Objects are not valid as a React child
You tried to render a plain object (or a Promise/Date) directly in JSX; React can only render strings, numbers, elements and arra…
TypeError: Cannot destructure property 'user' of 'useContext(...)' as it is undefined.
A component read a context with no matching Provider above it.
Cloudflare Error 1101: Worker threw exception
The Cloudflare Worker serving this route threw an uncaught JavaScript exception.
TypeError: x is not a function
You called something as a function, but its value is not a function (it’s undefined, a string, an object…).
TypeError: Cannot read properties of undefined (reading 'length')
Code checked .length on something that is undefined — typically an array or string that hasn’t loaded.
TypeError: x is not iterable
for…of, spread or destructuring was used on something that isn’t an array/iterable.
TS18048: 'x' is possibly 'undefined'. (TS2532: Object is possibly 'undefined'.)
TypeScript requires you to handle the case where a value may be undefined before using it.
Two steps away (35)
java.lang.ClassNotFoundException / NoClassDefFoundError
The JVM couldn’t find a class on the classpath at runtime.
java.lang.OutOfMemoryError: Java heap space
The JVM ran out of heap memory and garbage collection couldn’t free enough.
java.util.ConcurrentModificationException
A collection was modified while being iterated (even in a single thread).
Warning: Cannot modify header information - headers already sent
You called `header()`, `setcookie()` or `session_start()` after output had already been sent to the browser.
KeyError: 'x'
You accessed a dictionary key that doesn’t exist.
java.lang.ArrayIndexOutOfBoundsException: Index 5 out of bounds for length 5
Code accessed an array index outside 0 … length-1.
InvalidOperationException: Unable to resolve service for type 'X' while attempting to activate 'Y'
ASP.NET Core’s dependency injection container can’t build Y because one of its constructor dependencies (X) was never registered.
InvalidOperationException: Sequence contains no elements / more than one element
LINQ `First()`, `Single()`, `Last()` or `Max()` ran on an empty sequence (or `Single()` found several items).
Fatal error: Unexpectedly found nil while unwrapping an Optional value
Swift force-unwrapped (`!`) an optional that was nil, crashing the app.
NameError: name 'x' is not defined
Python doesn’t know the name — it was never assigned/imported in this scope, or it’s misspelled.
Error: Hydration failed because the initial UI does not match what was rendered on the server
The HTML rendered on the server differs from the first client render, so React (Next.js/Remix) can’t attach to it.
SyntaxError: Cannot use import statement outside a module
An `import` statement ran in a context treated as CommonJS (Node without "type": "module", a browser script without type="module"…
AttributeError: 'X' object has no attribute 'y'
You accessed an attribute or method that doesn’t exist on that object type.
SQL Error: division by zero / Divide by zero error encountered
An expression divided by a value that was 0 for at least one row.
TypeError: Cannot set properties of undefined (setting 'x')
Code assigned a property on a value that is undefined (or null).
Error: Too many re-renders. React limits the number of renders to prevent an infinite loop.
A state update runs during render, which triggers another render, which updates state again — forever.
Warning: Each child in a list should have a unique "key" prop
When rendering a list with `.map()`, each element needs a stable, unique `key` so React can track items between renders.
Error: Element type is invalid: expected a string (for built-in components) or a class/function (for composite components) but got: undefined
JSX referenced a component that is undefined — almost always a default/named import mismatch.
TypeError: Cannot convert undefined or null to object
Object.keys/entries/assign was called with undefined or null.
RuntimeError: Working outside of application context.
Code used current_app, g, or a Flask extension (like SQLAlchemy) without an active Flask application context.
Error: useNavigate() may be used only in the context of a <Router> component.
A React Router hook ran in a component that isn’t rendered inside a Router provider.
Cloudflare Error 1000: DNS points to prohibited IP
A proxied DNS record points at a Cloudflare IP address, creating a loop.
Cloudflare Error 1019: Compute server error (Workers)
A Cloudflare Worker routed the request to a loop or hit an internal compute error.
Cloudflare Error 1025: Please check back later (Workers request limit)
The site’s Cloudflare Workers plan exceeded its daily request limit (free plan: 100,000 requests/day).
Error: Cannot find module 'x' (MODULE_NOT_FOUND)
Node can’t resolve the module path — the package isn’t installed, or a relative path/extension is wrong.
TypeError: Assignment to constant variable.
Code reassigned a variable declared with const.
TypeError: x is not a constructor
new was used with something that isn’t a class/constructor — usually a wrong import.
TypeError: Cannot read properties of null (reading 'addEventListener')
document.querySelector/getElementById returned null, so the element doesn’t exist when the script runs.
TypeError: Reduce of empty array with no initial value
Array.reduce() ran on an empty array without an initial value.
RangeError: Invalid array length
An array was created or resized with a negative, fractional or enormous length.
Warning: Trying to access array offset on value of type null
Code used `$x['key']` where `$x` is null — usually a lookup or function that returned nothing.
RuntimeError: dictionary changed size during iteration
A dict (or set) was modified while being looped over.
TypeError [ERR_UNKNOWN_FILE_EXTENSION]: Unknown file extension ".ts"
Node tried to run a TypeScript file as ESM without a TypeScript loader.
TS2307: Cannot find module 'x' or its corresponding type declarations.
TypeScript can’t resolve the import — the package isn’t installed, the path alias isn’t configured, or there are no types.
TS7016: Could not find a declaration file for module 'x'. 'x.js' implicitly has an 'any' type.
The JavaScript package has no TypeScript types bundled and no @types package installed.
Map another error
Popular: 4035004000xC000007BTypeErrorCritical error404NullPointerException