Error map

invalid selector DOMException: Failed to execute 'querySelector' on 'Document': 'x' is not a valid selector

JavaScript · layer 1, On your device

Open the full error page →

Centre: this error. First ring: errors it is linked with (8). Outer ring: what those are linked with. Colours show the layer of a request each error belongs to. Click any dot to re-centre the map on it; hover to follow its connections. The centre dot opens the error page.

invalid selector — DOMException: Failed to execute 'querySelector' on 'Document': 'x' is not a valid selector (JavaScript)invalid sel…AbortError — AbortError: The user aborted a request. / signal is aborted without reason (JavaScript)AbortErrorChunkLoadError — ChunkLoadError: Loading chunk 123 failed. (JavaScript)ChunkLoadErrorbody already used — TypeError: Failed to execute 'json' on 'Response': body stream already read (JavaScript)body already usedTarget container is not a DOM element — Error: createRoot(...): Target container is not a DOM element. (React)Target container is…Invalid DOM property — Warning: Invalid DOM property `class`. Did you mean `className`? (React)Invalid DOM propertyaddEventListener on null — TypeError: Cannot read properties of null (reading 'addEventListener') (JavaScript)addEventListener on…ResizeObserver loop — ResizeObserver loop completed with undelivered notifications. (JavaScript)ResizeObserver loopFailed to execute on 'Node' — Console: Uncaught TypeError: Failed to execute 'appendChild' on 'Node': parameter 1 is not of type 'Node' (Browser)Failed to execute o…Failed to fetch — TypeError: Failed to fetch / NetworkError when attempting to fetch resource (JavaScript)Failed to fetchUnhandledPromiseRejection — Node.js: [UnhandledPromiseRejection] — This error originated either by throwing inside of an async function without a catch block (Node.js)UnhandledPromiseRej…reduce empty — TypeError: Reduce of empty array with no initial value (JavaScript)reduce emptyApp Service Application Error — Azure App Service: ":( Application Error" / container didn’t respond to HTTP pings (Azure)App Service Applica…FileNotFoundException assembly — Could not load file or assembly 'X, Version=…' or one of its dependencies (.NET)FileNotFoundExcepti…Unexpected token < — SyntaxError: Unexpected token '<' (HTML served instead of JavaScript) (JavaScript)Unexpected token <SocketException reset — java.net.SocketException: Connection reset (Java)SocketException res…await outside async — SyntaxError: await is only valid in async functions and the top level bodies of modules (JavaScript)await outside asyncinvalid array length — RangeError: Invalid array length (JavaScript)invalid array lengthnot a git repository — fatal: not a git repository (or any of the parent directories): .git (Git)not a git repositoryauthor identity unknown — Author identity unknown *** Please tell me who you are. (Git)author identity unk…JAVA_HOME not set — ERROR: JAVA_HOME is not set and no 'java' command could be found in your PATH. (Java)JAVA_HOME not setObjects are not valid as a React child — Error: Objects are not valid as a React child (React)Objects are not val…Nothing was returned from render — Error: Nothing was returned from render. This usually means a return statement is missing. (React)Nothing was returne…Adjacent JSX elements — Adjacent JSX elements must be wrapped in an enclosing tag. Did you want a JSX fragment <>...</>? (React)Adjacent JSX elemen…TypeError — TypeError: Cannot read properties of undefined (reading 'x') (JavaScript)TypeErrorTypeError set undefined — TypeError: Cannot set properties of undefined (setting 'x') (JavaScript)TypeError set undef…TypeError not iterable — TypeError: x is not iterable (JavaScript)TypeError not itera…ERR_BLOCKED_BY_CLIENT — net::ERR_BLOCKED_BY_CLIENT (JavaScript)ERR_BLOCKED_BY_CLIE…ERR_CONNECTION_REFUSED — net::ERR_CONNECTION_REFUSED (This site can't be reached — refused to connect) (JavaScript)ERR_CONNECTION_REFU…ERR_CERT_AUTHORITY_INVALID — NET::ERR_CERT_AUTHORITY_INVALID (Your connection is not private) (JavaScript)ERR_CERT_AUTHORITY_…reading length — TypeError: Cannot read properties of undefined (reading 'length') (JavaScript)reading lengthAw, Snap! — Chrome: Aw, Snap! Something went wrong while displaying this webpage. Error code: STATUS_ACCESS_VIOLATION / SIGILL / Out of Memory (Browser)Aw, Snap!captive portal — Browser: This network requires you to sign in — captive portal (hotel, airport, café Wi-Fi) blocking HTTPS sites (Browser)captive portal

Directly related (8)

AbortErrorJavaScript

AbortError: The user aborted a request. / signal is aborted without reason

A fetch was cancelled through an AbortController (or the browser cancelled it).

ChunkLoadErrorJavaScript

ChunkLoadError: Loading chunk 123 failed.

A lazily loaded JavaScript chunk couldn’t be downloaded — usually because a new deployment removed the old hashed files.

body already usedJavaScript

TypeError: Failed to execute 'json' on 'Response': body stream already read

A fetch Response body was consumed twice (e.g. calling .text() then .json()).

Target container is not a DOM elementReact

Error: createRoot(...): Target container is not a DOM element.

The element passed to createRoot/render doesn’t exist when the script runs.

Invalid DOM propertyReact

Warning: Invalid DOM property `class`. Did you mean `className`?

HTML attribute names were used in JSX instead of their React/DOM property names.

addEventListener on nullJavaScript

TypeError: Cannot read properties of null (reading 'addEventListener')

document.querySelector/getElementById returned null, so the element doesn’t exist when the script runs.

ResizeObserver loopJavaScript

ResizeObserver loop completed with undelivered notifications.

A ResizeObserver callback changed layout in a way that triggered another resize in the same frame.

Failed to execute on 'Node'Browser

Console: Uncaught TypeError: Failed to execute 'appendChild' on 'Node': parameter 1 is not of type 'Node'

A DOM method received something that is not a DOM node — `null`, `undefined`, a string, or a jQuery/React object instead of an el…

Two steps away (24)

Failed to fetchJavaScript

TypeError: Failed to fetch / NetworkError when attempting to fetch resource

The browser couldn’t complete the request at the network level — CORS, DNS, offline, blocked mixed content, or the server refused…

UnhandledPromiseRejectionNode.js

Node.js: [UnhandledPromiseRejection] — This error originated either by throwing inside of an async function without a catch block

A promise rejected and nothing handled it; since Node 15 this crashes the process.

reduce emptyJavaScript

TypeError: Reduce of empty array with no initial value

Array.reduce() ran on an empty array without an initial value.

App Service Application ErrorAzure

Azure App Service: ":( Application Error" / container didn’t respond to HTTP pings

App Service started your app but it crashed or never listened on the expected port.

FileNotFoundException assembly.NET

Could not load file or assembly 'X, Version=…' or one of its dependencies

The runtime couldn’t find or load a referenced DLL — missing from the output, wrong version, or wrong platform (x86/x64).

Unexpected token <JavaScript

SyntaxError: Unexpected token '<' (HTML served instead of JavaScript)

The browser loaded a .js file but received HTML (an error page or the SPA index.html).

SocketException resetJava

java.net.SocketException: Connection reset

The remote side closed the TCP connection abruptly while Java was reading or writing.

await outside asyncJavaScript

SyntaxError: await is only valid in async functions and the top level bodies of modules

await was used inside a function that isn’t async (or in a classic, non-module script).

invalid array lengthJavaScript

RangeError: Invalid array length

An array was created or resized with a negative, fractional or enormous length.

not a git repositoryGit

fatal: not a git repository (or any of the parent directories): .git

You ran a Git command outside a Git working tree.

author identity unknownGit

Author identity unknown *** Please tell me who you are.

Git doesn’t know your name and email for commits.

JAVA_HOME not setJava

ERROR: JAVA_HOME is not set and no 'java' command could be found in your PATH.

Build tools (Gradle, Maven, Android tools) can’t find a JDK.

Objects are not valid as a React childReact

Error: Objects are not valid as a React child

You tried to render a plain object (or a Promise/Date) directly in JSX; React can only render strings, numbers, elements and arra…

Nothing was returned from renderReact

Error: Nothing was returned from render. This usually means a return statement is missing.

A component returned undefined (React 17 and earlier) — usually a missing return or a return followed by a line break.

Adjacent JSX elementsReact

Adjacent JSX elements must be wrapped in an enclosing tag. Did you want a JSX fragment <>...</>?

A component returns two sibling JSX elements without a single parent.

TypeErrorJavaScript

TypeError: Cannot read properties of undefined (reading 'x')

You tried to access a property on a value that is `undefined` (or `null`) — usually data that hasn’t loaded yet or a wrong proper…

TypeError set undefinedJavaScript

TypeError: Cannot set properties of undefined (setting 'x')

Code assigned a property on a value that is undefined (or null).

TypeError not iterableJavaScript

TypeError: x is not iterable

for…of, spread or destructuring was used on something that isn’t an array/iterable.

ERR_BLOCKED_BY_CLIENTJavaScript

net::ERR_BLOCKED_BY_CLIENT

A browser extension (ad blocker, privacy tool) blocked the request.

ERR_CONNECTION_REFUSEDJavaScript

net::ERR_CONNECTION_REFUSED (This site can't be reached — refused to connect)

The browser reached the host but nothing was listening on that port.

ERR_CERT_AUTHORITY_INVALIDJavaScript

NET::ERR_CERT_AUTHORITY_INVALID (Your connection is not private)

The site’s certificate isn’t signed by a CA the browser trusts — self-signed, missing intermediates, or intercepted by a proxy.

reading lengthJavaScript

TypeError: Cannot read properties of undefined (reading 'length')

Code checked .length on something that is undefined — typically an array or string that hasn’t loaded.

Aw, Snap!Browser

Chrome: Aw, Snap! Something went wrong while displaying this webpage. Error code: STATUS_ACCESS_VIOLATION / SIGILL / Out of Memory

A Chrome tab crashed — out of memory, a faulty extension, a graphics/driver issue or a very heavy page.

captive portalBrowser

Browser: This network requires you to sign in — captive portal (hotel, airport, café Wi-Fi) blocking HTTPS sites

The Wi-Fi needs a login or acceptance page first; until you complete it, secure sites fail with certificate or connection errors.