Error map
Failed to execute on 'Node' Console: Uncaught TypeError: Failed to execute 'appendChild' on 'Node': parameter 1 is not of type 'Node'
Browser · layer 1, On your device
Centre: this error. First ring: errors it is linked with (7). Outer ring: what those are linked with. Colours show the layer of a request each error belongs to. Click any dot to re-centre the map on it; hover to follow its connections. The centre dot opens the error page.
Directly related (7)
TypeError: Cannot read properties of undefined (reading 'length')
Code checked .length on something that is undefined — typically an array or string that hasn’t loaded.
DOMException: Failed to execute 'querySelector' on 'Document': 'x' is not a valid selector
The CSS selector string is invalid — often an ID starting with a digit or containing special characters.
TypeError: Cannot read properties of null (reading 'addEventListener')
document.querySelector/getElementById returned null, so the element doesn’t exist when the script runs.
ResizeObserver loop completed with undelivered notifications.
A ResizeObserver callback changed layout in a way that triggered another resize in the same frame.
Chrome: Aw, Snap! Something went wrong while displaying this webpage. Error code: STATUS_ACCESS_VIOLATION / SIGILL / Out of Memory
A Chrome tab crashed — out of memory, a faulty extension, a graphics/driver issue or a very heavy page.
Browser: This network requires you to sign in — captive portal (hotel, airport, café Wi-Fi) blocking HTTPS sites
The Wi-Fi needs a login or acceptance page first; until you complete it, secure sites fail with certificate or connection errors.
Console: SecurityError: Failed to execute 'toDataURL' / 'getImageData' on 'HTMLCanvasElement': Tainted canvases may not be exported
You drew an image from another origin onto a canvas without CORS permission, so the browser blocks reading pixels back out.
Two steps away (21)
TypeError: Cannot read properties of undefined (reading 'x')
You tried to access a property on a value that is `undefined` (or `null`) — usually data that hasn’t loaded yet or a wrong proper…
java.lang.ArrayIndexOutOfBoundsException: Index 5 out of bounds for length 5
Code accessed an array index outside 0 … length-1.
TypeError: Cannot set properties of undefined (setting 'x')
Code assigned a property on a value that is undefined (or null).
AbortError: The user aborted a request. / signal is aborted without reason
A fetch was cancelled through an AbortController (or the browser cancelled it).
ChunkLoadError: Loading chunk 123 failed.
A lazily loaded JavaScript chunk couldn’t be downloaded — usually because a new deployment removed the old hashed files.
TypeError: Failed to execute 'json' on 'Response': body stream already read
A fetch Response body was consumed twice (e.g. calling .text() then .json()).
TypeError: x is not iterable
for…of, spread or destructuring was used on something that isn’t an array/iterable.
TypeError: Cannot convert undefined or null to object
Object.keys/entries/assign was called with undefined or null.
Angular: TypeError: Cannot read properties of undefined (reading 'nativeElement') — @ViewChild used in ngOnInit
A `@ViewChild` / `viewChild()` reference is `undefined` because the view is not created yet, or the element sits inside `@if` / `…
net::ERR_BLOCKED_BY_CLIENT
A browser extension (ad blocker, privacy tool) blocked the request.
net::ERR_CONNECTION_REFUSED (This site can't be reached — refused to connect)
The browser reached the host but nothing was listening on that port.
NET::ERR_CERT_AUTHORITY_INVALID (Your connection is not private)
The site’s certificate isn’t signed by a CA the browser trusts — self-signed, missing intermediates, or intercepted by a proxy.
Blue Screen: MEMORY_MANAGEMENT (Stop code 0x0000001A)
Windows detected a severe memory-management error — commonly faulty RAM, unstable memory settings or a bad driver.
RangeError: Invalid array length
An array was created or resized with a negative, fractional or enormous length.
Chrome: This page isn’t working — sent an invalid response. ERR_CONTENT_DECODING_FAILED
The response claims to be compressed (gzip/brotli) but cannot be decompressed — it was double-compressed, truncated or not compre…
HTTP 407 Proxy Authentication Required
A proxy between you and the server requires credentials before it will forward your request.
HTTP 408 Request Timeout
The server closed the connection because the client took too long to send the complete request.
TypeError: Failed to fetch / NetworkError when attempting to fetch resource
The browser couldn’t complete the request at the network level — CORS, DNS, offline, blocked mixed content, or the server refused…
CORS Error: No 'Access-Control-Allow-Origin' header is present
The browser blocked a cross-origin request because the server’s response didn’t include the CORS headers allowing your site’s ori…
NotAllowedError: Failed to execute 'writeText' on 'Clipboard': Document is not focused.
The Clipboard API refused to write — the page isn’t focused, there was no user gesture, or the context isn’t secure.
Chrome DevTools: net::ERR_FAILED — a request failed with no specific reason (CORS, extension, mixed content or network)
ERR_FAILED is Chrome’s catch-all for a failed request. In DevTools it very often hides a CORS rejection, an extension, or a block…
Map another error
Popular: 4035004000xC000007BTypeErrorCritical error404NullPointerException