Error map
sharp module Error: Could not load the "sharp" module using the linux-x64 runtime
npm · layer 7, Build & delivery
Centre: this error. First ring: errors it is linked with (7). Outer ring: what those are linked with. Colours show the layer of a request each error belongs to. Click any dot to re-centre the map on it; hover to follow its connections. The centre dot opens the error page.
Directly related (7)
gyp ERR! build error / node-gyp rebuild failed
A dependency with native C/C++ code couldn’t compile — missing build tools, Python, or an unsupported Node version.
FATAL: database files are incompatible with server — The data directory was initialized by PostgreSQL version 15, which is not compatible with this version 16
A newer (or older) PostgreSQL major version was started on an existing data directory.
Error: /app/node_modules/bcrypt/lib/binding/bcrypt_lib.node: invalid ELF header
A native module compiled for macOS/Windows is being loaded on Linux.
You installed esbuild for another platform than the one you're currently using.
node_modules contains esbuild’s binary for a different OS/CPU.
FATAL: data directory "/var/lib/postgresql/data" has invalid permissions — Permissions should be u=rwx (0700) or u=rwx,g=rx (0750).
PostgreSQL refuses to start because the data directory is too open or owned by the wrong user.
gyp: No Xcode or CLT version detected!
node-gyp on macOS can’t find the Xcode Command Line Tools to compile native modules.
Error: Cannot find module @rollup/rollup-linux-x64-gnu. npm has a bug related to optional dependencies
Rollup’s (and Vite’s) platform-specific optional dependency wasn’t installed — an npm optional-dependency bug with lockfiles from…
Two steps away (13)
ModuleNotFoundError: No module named 'x'
Python can’t find the module you import — it isn’t installed in the interpreter/virtualenv that’s running, or the import path is…
npm ERR! code ELIFECYCLE / Command failed with exit code 1
An npm script (build, start, test, postinstall) exited with an error. ELIFECYCLE is only the wrapper — the real error is printed…
Error: error:0308010C:digital envelope routines::unsupported
An old build tool (webpack 4, old react-scripts) uses a hash algorithm that OpenSSL 3 in Node 17+ disables.
Authentication plugin 'caching_sha2_password' cannot be loaded
An old MySQL client/driver can’t use MySQL 8’s default authentication plugin.
npm ERR! cb() never called!
An old npm crash during install — usually network/cache corruption.
Error: Cannot find matching keyid (Corepack signature verification)
An older Corepack couldn’t verify the signature of a newly published pnpm/yarn release after npm rotated its signing keys.
Cannot connect to the Docker daemon at unix:///var/run/docker.sock. Is the docker daemon running?
The docker CLI can’t talk to the Docker engine — it isn’t running, or your user can’t access the socket.
Linux: Permission denied
Your user (or the service user) lacks read/write/execute permission on a file, directory or one of its parents.
HTTP 403 Forbidden
The server understood the request but refuses to authorize it — you (or the server process) are not allowed to access this resour…
xcrun: error: invalid active developer path (/Library/Developer/CommandLineTools), missing xcrun
The Xcode Command Line Tools are missing or broken — typical right after a macOS update.
Error: Cannot find module 'x' (MODULE_NOT_FOUND)
Node can’t resolve the module path — the package isn’t installed, or a relative path/extension is wrong.
npm ERR! code EINTEGRITY — sha512 integrity checksum failed
A downloaded package’s hash doesn’t match the integrity value in package-lock.json — a corrupted cache, a changed tarball, or a l…
npm ERR! `npm ci` can only install packages when your package.json and package-lock.json are in sync
package-lock.json doesn’t match package.json, so npm ci refuses to install.
Map another error
Popular: 4035004000xC000007BTypeErrorCritical error404NullPointerException