Error map

invalid active developer path xcrun: error: invalid active developer path (/Library/Developer/CommandLineTools), missing xcrun

iOS · layer 1, On your device

Open the full error page →

Centre: this error. First ring: errors it is linked with (8). Outer ring: what those are linked with. Colours show the layer of a request each error belongs to. Click any dot to re-centre the map on it; hover to follow its connections. The centre dot opens the error page.

invalid active developer path — xcrun: error: invalid active developer path (/Library/Developer/CommandLineTools), missing xcrun (iOS)invalid act…Failed to prepare device for development — Xcode: Failed to prepare device for development / iPhone is not available. Please reconnect the device (iOS)Failed to prepare d…ITMS-90725 — ITMS-90725: SDK version issue — This app was built with the iOS 17.x SDK. All iOS apps submitted to the App Store must be built with the iOS 18 SDK or later (iOS)ITMS-90725Cannot preview in this file — SwiftUI Preview: Cannot preview in this file — the preview crashed / failed to build (iOS)Cannot preview in t…zsh: command not found: brew — macOS: zsh: command not found: brew (Homebrew not on PATH on Apple Silicon) (macOS)zsh: command not fo…command not found — bash: command not found (Linux)command not foundNo Xcode or CLT — gyp: No Xcode or CLT version detected! (npm)No Xcode or CLTSigning requires a development team — Signing for "App" requires a development team. Select a development team in the Signing & Capabilities editor (iOS)Signing requires a …No such module — Swift: No such module 'X' (module not found) (iOS)No such moduledoesn't include the currently selected device — Provisioning profile "x" doesn't include the currently selected device (iOS)doesn't include the…Undefined symbols for architecture — Undefined symbol(s) for architecture arm64 — linker command failed with exit code 1 (iOS)Undefined symbols f…Untrusted Developer — Could not launch "App": process launch failed: Security / Untrusted Developer (iOS)Untrusted DeveloperITMS-91053 — ITMS-91053: Missing API declaration — Your app's code references required reason APIs (privacy manifest) (iOS)ITMS-91053ITMS-90683 — ITMS-90683: Missing purpose string in Info.plist (NSCameraUsageDescription etc.) (iOS)ITMS-90683Redundant Binary Upload — ITMS-4238: Redundant Binary Upload. You've already uploaded a build with build number 'x' for version number 'y' (iOS)Redundant Binary Up…Unexpectedly found nil — Fatal error: Unexpectedly found nil while unwrapping an Optional value (iOS)Unexpectedly found …Modifying state during view update — SwiftUI: Modifying state during view update, this will cause undefined behavior (iOS)Modifying state dur…Publishing changes from background threads — SwiftUI: Publishing changes from background threads is not allowed; make sure to publish values from the main thread (iOS)Publishing changes …executable file not found in $PATH — OCI runtime create failed: exec: "x": executable file not found in $PATH (Docker)executable file not…Argument list too long — bash: /bin/rm: Argument list too long (Linux)Argument list too l…is damaged and can’t be opened — macOS: “App” is damaged and can’t be opened. You should move it to the Trash. (macOS)is damaged and can’…not a git repository — fatal: not a git repository (or any of the parent directories): .git (Git)not a git repositoryENOENT — Error: ENOENT: no such file or directory (Node.js)ENOENTEACCES — Linux: Permission denied (Linux)EACCESgyp ERR! — gyp ERR! build error / node-gyp rebuild failed (npm)gyp ERR!cb() never called — npm ERR! cb() never called! (npm)cb() never calledsharp module — Error: Could not load the "sharp" module using the linux-x64 runtime (npm)sharp moduleNo signing certificate — Xcode: No signing certificate "iOS Development" found (iOS)No signing certific…Failed to register bundle identifier — Failed to register bundle identifier: The app identifier "com.x" cannot be registered to your development team because it is not available (iOS)Failed to register …doesn't include signing certificate — Provisioning profile "x" doesn't include signing certificate "Apple Development: Name (ID)" (iOS)doesn't include sig…CocoaPods compatible versions — CocoaPods could not find compatible versions for pod (iOS)CocoaPods compatibl…Unable to find a specification — [!] Unable to find a specification for `X` depended upon by `Y` (iOS)Unable to find a sp…library not found for -lPods — ld: library not found for -lPods-AppName / framework not found Pods_App (iOS)library not found f…

Directly related (8)

Failed to prepare device for developmentiOS

Xcode: Failed to prepare device for development / iPhone is not available. Please reconnect the device

Xcode couldn’t set up the device — usually the device’s iOS version is newer than Xcode supports, Developer Mode is off, or pairi…

ITMS-90725iOS

ITMS-90725: SDK version issue — This app was built with the iOS 17.x SDK. All iOS apps submitted to the App Store must be built with the iOS 18 SDK or later

App Store Connect requires uploads to be built with a recent Xcode/iOS SDK (raised every spring).

Cannot preview in this fileiOS

SwiftUI Preview: Cannot preview in this file — the preview crashed / failed to build

Xcode Previews couldn’t build or run the view — compile errors elsewhere, a crash in preview data, or preview-specific environmen…

zsh: command not found: brewmacOS

macOS: zsh: command not found: brew (Homebrew not on PATH on Apple Silicon)

Homebrew is installed in /opt/homebrew on Apple Silicon Macs, which isn’t on PATH until you add its shellenv line.

command not foundLinux

bash: command not found

The shell can’t find an executable with that name in any directory on your PATH.

No Xcode or CLTnpm

gyp: No Xcode or CLT version detected!

node-gyp on macOS can’t find the Xcode Command Line Tools to compile native modules.

Signing requires a development teamiOS

Signing for "App" requires a development team. Select a development team in the Signing & Capabilities editor

No Apple developer team is selected for the target, so Xcode can’t sign the app.

No such moduleiOS

Swift: No such module 'X' (module not found)

Xcode can’t find a Swift package, pod or framework you import.

Two steps away (24)

doesn't include the currently selected deviceiOS

Provisioning profile "x" doesn't include the currently selected device

The development profile doesn’t list this iPhone’s UDID, so Xcode can’t install the build on it.

Undefined symbols for architectureiOS

Undefined symbol(s) for architecture arm64 — linker command failed with exit code 1

The linker can’t find the implementation of a symbol your code uses — a missing framework/library, a file not in the target, or a…

Untrusted DeveloperiOS

Could not launch "App": process launch failed: Security / Untrusted Developer

The app installed, but iOS won’t run it because the developer certificate hasn’t been trusted on the device (common with free/ent…

ITMS-91053iOS

ITMS-91053: Missing API declaration — Your app's code references required reason APIs (privacy manifest)

The app (or an SDK in it) uses “required reason” APIs like UserDefaults, file timestamps or disk space without declaring reasons…

ITMS-90683iOS

ITMS-90683: Missing purpose string in Info.plist (NSCameraUsageDescription etc.)

The binary references a privacy-sensitive API, but Info.plist lacks the matching usage description.

Redundant Binary UploadiOS

ITMS-4238: Redundant Binary Upload. You've already uploaded a build with build number 'x' for version number 'y'

The build number (CFBundleVersion) has already been used for that version in App Store Connect.

Unexpectedly found niliOS

Fatal error: Unexpectedly found nil while unwrapping an Optional value

Swift force-unwrapped (`!`) an optional that was nil, crashing the app.

Modifying state during view updateiOS

SwiftUI: Modifying state during view update, this will cause undefined behavior

A @State/@Published value was changed while SwiftUI was computing a view’s body.

Publishing changes from background threadsiOS

SwiftUI: Publishing changes from background threads is not allowed; make sure to publish values from the main thread

An ObservableObject’s @Published property was updated from a background thread.

executable file not found in $PATHDocker

OCI runtime create failed: exec: "x": executable file not found in $PATH

The command you asked the container to run doesn’t exist inside the image — wrong command name, a shell that isn’t installed (bas…

Argument list too longLinux

bash: /bin/rm: Argument list too long

A glob like * expanded to more file names than the kernel allows in one command (ARG_MAX), so the command never ran.

is damaged and can’t be openedmacOS

macOS: “App” is damaged and can’t be opened. You should move it to the Trash.

Gatekeeper blocked an app that isn’t properly signed/notarized or was modified after download (quarantine attribute).

not a git repositoryGit

fatal: not a git repository (or any of the parent directories): .git

You ran a Git command outside a Git working tree.

ENOENTNode.js

Error: ENOENT: no such file or directory

A file or directory the program tried to open doesn’t exist at that path.

EACCESLinux

Linux: Permission denied

Your user (or the service user) lacks read/write/execute permission on a file, directory or one of its parents.

gyp ERR!npm

gyp ERR! build error / node-gyp rebuild failed

A dependency with native C/C++ code couldn’t compile — missing build tools, Python, or an unsupported Node version.

cb() never callednpm

npm ERR! cb() never called!

An old npm crash during install — usually network/cache corruption.

sharp modulenpm

Error: Could not load the "sharp" module using the linux-x64 runtime

sharp’s native binary for this OS/CPU isn’t installed — usually node_modules installed on another platform (Mac → Linux/Docker).

No signing certificateiOS

Xcode: No signing certificate "iOS Development" found

Xcode can’t find a valid code-signing certificate + private key for the selected team in your keychain.

Failed to register bundle identifieriOS

Failed to register bundle identifier: The app identifier "com.x" cannot be registered to your development team because it is not available

Another developer team already owns that bundle identifier, so Xcode can’t create it for your team.

doesn't include signing certificateiOS

Provisioning profile "x" doesn't include signing certificate "Apple Development: Name (ID)"

The profile was created with a different certificate than the one installed in your keychain.

CocoaPods compatible versionsiOS

CocoaPods could not find compatible versions for pod

pod install can’t satisfy the version constraints — outdated spec repo, a higher deployment target required, or two pods needing…

Unable to find a specificationiOS

[!] Unable to find a specification for `X` depended upon by `Y`

CocoaPods can’t find the pod (or version) in its spec repos — stale local specs, a private spec repo not added, or a typo.

library not found for -lPodsiOS

ld: library not found for -lPods-AppName / framework not found Pods_App

The linker can’t find the CocoaPods library — usually because the .xcodeproj was opened instead of the .xcworkspace, or pods were…