Error map

ITMS-90683 ITMS-90683: Missing purpose string in Info.plist (NSCameraUsageDescription etc.)

iOS · layer 1, On your device

Open the full error page →

Centre: this error. First ring: errors it is linked with (8). Outer ring: what those are linked with. Colours show the layer of a request each error belongs to. Click any dot to re-centre the map on it; hover to follow its connections. The centre dot opens the error page.

ITMS-90683 — ITMS-90683: Missing purpose string in Info.plist (NSCameraUsageDescription etc.) (iOS)ITMS-90683Operation not permitted (macOS privacy) — macOS: Operation not permitted — Terminal/app lacks Full Disk Access (TCC privacy protection) (macOS)Operation not permi…ITMS-90725 — ITMS-90725: SDK version issue — This app was built with the iOS 17.x SDK. All iOS apps submitted to the App Store must be built with the iOS 18 SDK or later (iOS)ITMS-90725ITMS-91053 — ITMS-91053: Missing API declaration — Your app's code references required reason APIs (privacy manifest) (iOS)ITMS-91053ITMS-90717 — ITMS-90717: Invalid App Store Icon. The App Store Icon in the asset catalog can't be transparent nor contain an alpha channel (iOS)ITMS-90717attempted to access privacy-sensitive data without a usage description — This app has crashed because it attempted to access privacy-sensitive data without a usage description (iOS)attempted to access…ITMS-90206 — ITMS-90206: Invalid Bundle. The bundle at 'App.appex' contains disallowed file 'Frameworks' (iOS)ITMS-90206not allowed to query for scheme — -canOpenURL: failed for URL: "x://" - error: "This app is not allowed to query for scheme x" (iOS)not allowed to quer…Redundant Binary Upload — ITMS-4238: Redundant Binary Upload. You've already uploaded a build with build number 'x' for version number 'y' (iOS)Redundant Binary Up…EACCES — npm ERR! code EACCES — permission denied (npm)EACCESdaemon — Cannot connect to the Docker daemon at unix:///var/run/docker.sock. Is the docker daemon running? (Docker)daemonEACCES — Linux: Permission denied (Linux)EACCESSigning requires a development team — Signing for "App" requires a development team. Select a development team in the Signing & Capabilities editor (iOS)Signing requires a …No such module — Swift: No such module 'X' (module not found) (iOS)No such moduleUndefined symbols for architecture — Undefined symbol(s) for architecture arm64 — linker command failed with exit code 1 (iOS)Undefined symbols f…ATS — App Transport Security has blocked a cleartext HTTP resource load (iOS)ATSintegrity could not be verified — Unable to Install "App": This app cannot be installed because its integrity could not be verified (iOS)integrity could not…Stack overflow — .NET: Stack overflow. / Process is terminated due to StackOverflowException (.NET)Stack overflowEXC_BAD_ACCESS — Thread 1: EXC_BAD_ACCESS (code=1, address=0x0) (iOS)EXC_BAD_ACCESSSIGABRT — Thread 1: signal SIGABRT (app crashes with "libc++abi: terminating") (iOS)SIGABRTCall to undefined function — PHP Fatal error: Uncaught Error: Call to undefined function (PHP)Call to undefined f…could not find driver — PDOException: could not find driver (PHP)could not find driv…GD missing — Fatal error: Uncaught Error: Call to undefined function imagecreatefromjpeg() (PHP)GD missingbuilt for iOS, linking for simulator — Building for iOS Simulator, but linking in object file built for iOS, for architecture arm64 (iOS)built for iOS, link…CDN: trunk URL couldn't be downloaded — [!] CDN: trunk URL couldn't be downloaded: https://cdn.cocoapods.org/... (iOS)CDN: trunk URL coul…Cannot convert value of type — Swift: Cannot convert value of type 'X' to expected argument type 'Y' (iOS)Cannot convert valu…Version code has already been used — Play Console: Version code 1 has already been used. Try another version code (Android)Version code has al…Command CodeSign failed — Command CodeSign failed with a nonzero exit code (errSecInternalComponent / resource fork, Finder information not allowed) (iOS)Command CodeSign fa…

Directly related (8)

Operation not permitted (macOS privacy)macOS

macOS: Operation not permitted — Terminal/app lacks Full Disk Access (TCC privacy protection)

macOS privacy protection (TCC) blocked access to protected folders (Desktop, Documents, Downloads, Mail, Photos, external volumes…

ITMS-90725iOS

ITMS-90725: SDK version issue — This app was built with the iOS 17.x SDK. All iOS apps submitted to the App Store must be built with the iOS 18 SDK or later

App Store Connect requires uploads to be built with a recent Xcode/iOS SDK (raised every spring).

ITMS-91053iOS

ITMS-91053: Missing API declaration — Your app's code references required reason APIs (privacy manifest)

The app (or an SDK in it) uses “required reason” APIs like UserDefaults, file timestamps or disk space without declaring reasons…

ITMS-90717iOS

ITMS-90717: Invalid App Store Icon. The App Store Icon in the asset catalog can't be transparent nor contain an alpha channel

The 1024×1024 App Store icon has an alpha channel/transparency, which App Store Connect rejects.

attempted to access privacy-sensitive data without a usage descriptioniOS

This app has crashed because it attempted to access privacy-sensitive data without a usage description

The app requested camera, photos, microphone, location, contacts, etc. without the required NS…UsageDescription in Info.plist, so…

ITMS-90206iOS

ITMS-90206: Invalid Bundle. The bundle at 'App.appex' contains disallowed file 'Frameworks'

An app extension (or framework) embeds its own Frameworks folder; only the main app may embed frameworks.

not allowed to query for schemeiOS

-canOpenURL: failed for URL: "x://" - error: "This app is not allowed to query for scheme x"

The app called canOpenURL for a scheme not listed in LSApplicationQueriesSchemes in Info.plist.

Redundant Binary UploadiOS

ITMS-4238: Redundant Binary Upload. You've already uploaded a build with build number 'x' for version number 'y'

The build number (CFBundleVersion) has already been used for that version in App Store Connect.

Two steps away (19)

EACCESnpm

npm ERR! code EACCES — permission denied

npm can’t write to a directory — usually global installs into a root-owned folder.

daemonDocker

Cannot connect to the Docker daemon at unix:///var/run/docker.sock. Is the docker daemon running?

The docker CLI can’t talk to the Docker engine — it isn’t running, or your user can’t access the socket.

EACCESLinux

Linux: Permission denied

Your user (or the service user) lacks read/write/execute permission on a file, directory or one of its parents.

Signing requires a development teamiOS

Signing for "App" requires a development team. Select a development team in the Signing & Capabilities editor

No Apple developer team is selected for the target, so Xcode can’t sign the app.

No such moduleiOS

Swift: No such module 'X' (module not found)

Xcode can’t find a Swift package, pod or framework you import.

Undefined symbols for architectureiOS

Undefined symbol(s) for architecture arm64 — linker command failed with exit code 1

The linker can’t find the implementation of a symbol your code uses — a missing framework/library, a file not in the target, or a…

ATSiOS

App Transport Security has blocked a cleartext HTTP resource load

iOS blocked an `http://` request (or a weak-TLS HTTPS one) because App Transport Security requires secure connections.

integrity could not be verifiediOS

Unable to Install "App": This app cannot be installed because its integrity could not be verified

iOS rejected the app because its signature doesn’t validate for this device — expired/revoked certificate, ad-hoc profile without…

Stack overflow.NET

.NET: Stack overflow. / Process is terminated due to StackOverflowException

Infinite or very deep recursion exhausted the thread’s stack; .NET can’t catch it and terminates the process.

EXC_BAD_ACCESSiOS

Thread 1: EXC_BAD_ACCESS (code=1, address=0x0)

The app accessed memory it shouldn’t — a dangling pointer, released object, unsafe pointer misuse, a data race, or infinite recur…

SIGABRTiOS

Thread 1: signal SIGABRT (app crashes with "libc++abi: terminating")

The app deliberately aborted — an uncaught exception, failed assertion or fatalError. The console above the crash has the real me…

Call to undefined functionPHP

PHP Fatal error: Uncaught Error: Call to undefined function

PHP can’t find the function you called — usually a missing extension, missing include, or namespace issue.

could not find driverPHP

PDOException: could not find driver

The PDO driver for your database (pdo_mysql, pdo_pgsql, pdo_sqlite) isn’t installed or enabled.

GD missingPHP

Fatal error: Uncaught Error: Call to undefined function imagecreatefromjpeg()

The GD extension (or its JPEG/WebP support) isn’t installed for the PHP version serving the site.

built for iOS, linking for simulatoriOS

Building for iOS Simulator, but linking in object file built for iOS, for architecture arm64

A library contains device-only arm64 code; Apple Silicon simulators also run arm64 and need a separate simulator slice.

CDN: trunk URL couldn't be downloadediOS

[!] CDN: trunk URL couldn't be downloaded: https://cdn.cocoapods.org/...

CocoaPods couldn’t reach its CDN spec repo — network/proxy issues, rate limiting, or an outdated CocoaPods.

Cannot convert value of typeiOS

Swift: Cannot convert value of type 'X' to expected argument type 'Y'

The value’s type doesn’t match what the function or property expects.

Version code has already been usedAndroid

Play Console: Version code 1 has already been used. Try another version code

Every upload to a Play app needs a higher versionCode than any previous upload (in any track).

Command CodeSign failediOS

Command CodeSign failed with a nonzero exit code (errSecInternalComponent / resource fork, Finder information not allowed)

codesign failed — the keychain is locked (CI/SSH), the private key is inaccessible, or files carry extended attributes that can’t…