Error map

Stack overflow .NET: Stack overflow. / Process is terminated due to StackOverflowException

.NET · layer 4, Application & API

Open the full error page →

Centre: this error. First ring: errors it is linked with (12). Outer ring: what those are linked with. Colours show the layer of a request each error belongs to. Click any dot to re-centre the map on it; hover to follow its connections. The centre dot opens the error page.

Stack overflow — .NET: Stack overflow. / Process is terminated due to StackOverflowException (.NET)Stack overf…SIGSEGV — Segmentation fault (core dumped) (Linux)SIGSEGV0xC0000142 — The application was unable to start correctly (0xc0000142) (Windows)0xC0000142terminate called after throwing an instance of — C++: terminate called after throwing an instance of 'std::out_of_range' — what(): vector::_M_range_check (C/C++)terminate called af…Maximum function nesting — Fatal error: Maximum function nesting level of '256' reached, aborting! (PHP)Maximum function ne…dyld: Library not loaded — dyld: Library not loaded: @rpath/X.framework/X — Reason: image not found (crash on launch) (iOS)dyld: Library not l…RangeError — RangeError: Maximum call stack size exceeded (JavaScript)RangeErrorIllegal instruction — Illegal instruction (core dumped) (SIGILL) (Linux)Illegal instructiondouble free or corruption — C/C++: free(): double free detected / double free or corruption (out) — Aborted (core dumped) (C/C++)double free or corr…StackOverflowError — java.lang.StackOverflowError (Java)StackOverflowErrorrecursion limit — Msg 530: The statement terminated. The maximum recursion 100 has been exhausted before statement completion. / MySQL 3636 Recursive query aborted after 1001 iterations (SQL)recursion limitOutOfMemoryException — System.OutOfMemoryException: Exception of type 'System.OutOfMemoryException' was thrown (.NET)OutOfMemoryExceptionRecursionError — RecursionError: maximum recursion depth exceeded (Python)RecursionErrorCrashLoopBackOff — Kubernetes: CrashLoopBackOff (Kubernetes)CrashLoopBackOffOOM killer — Killed / Out of memory: Killed process (Linux OOM killer) (Linux)OOM killerinvalid string length — RangeError: Invalid string length (JavaScript)invalid string leng…0xC000007B — The application was unable to start correctly (0xc000007b) (Windows)0xC000007BVCRUNTIME140.dll — VCRUNTIME140.dll was not found / MSVCP140.dll is missing (Windows)VCRUNTIME140.dllUnexpectedly found nil — Fatal error: Unexpectedly found nil while unwrapping an Optional value (iOS)Unexpectedly found …IllegalArgumentException — java.lang.IllegalArgumentException (Java)IllegalArgumentExce…IllegalStateException — java.lang.IllegalStateException (Java)IllegalStateExcepti…ArithmeticException — java.lang.ArithmeticException: / by zero (Java)ArithmeticExceptionAllowed memory size exhausted — PHP Fatal error: Allowed memory size of X bytes exhausted (PHP)Allowed memory size…Call to undefined function — PHP Fatal error: Uncaught Error: Call to undefined function (PHP)Call to undefined f…Cannot redeclare — Fatal error: Cannot redeclare function foo() (previously declared in …) (PHP)Cannot redeclareerror while loading shared libraries — error while loading shared libraries: libX.so.N: cannot open shared object file: No such file or directory (Linux)error while loading…EXC_BAD_ACCESS — Thread 1: EXC_BAD_ACCESS (code=1, address=0x0) (iOS)EXC_BAD_ACCESSSIGABRT — Thread 1: signal SIGABRT (app crashes with "libc++abi: terminating") (iOS)SIGABRTToo many re-renders — Error: Too many re-renders. React limits the number of renders to prevent an infinite loop. (React)Too many re-rendersJsonException object cycle — JsonException: A possible object cycle was detected (.NET)JsonException objec…TypeError set undefined — TypeError: Cannot set properties of undefined (setting 'x') (JavaScript)TypeError set undef…exec format error — exec /usr/local/bin/docker-entrypoint.sh: exec format error (Docker)exec format errorrecovery mode — FATAL: the database system is in recovery mode (PostgreSQL)recovery modeno matching manifest — no matching manifest for linux/arm64/v8 in the manifest list entries (Docker)no matching manifestOOMKilled — Kubernetes: OOMKilled (exit code 137) (Kubernetes)OOMKilledOutOfMemoryError — java.lang.OutOfMemoryError: Java heap space (Java)OutOfMemoryErrorMEMORY_MANAGEMENT — Blue Screen: MEMORY_MANAGEMENT (Stop code 0x0000001A) (Windows)MEMORY_MANAGEMENTGROUP BY — Column must appear in the GROUP BY clause / isn't in GROUP BY (MySQL 1055 only_full_group_by) (SQL)GROUP BYaggregate in WHERE — ERROR: aggregate functions are not allowed in WHERE (use HAVING) / MySQL 1111 Invalid use of group function (SQL)aggregate in WHERE1136 — MySQL ERROR 1136 (21S01): Column count doesn't match value count at row 1 (SQL)1136504 — HTTP 504 Gateway Timeout (HTTP)504524 — Cloudflare Error 524: A Timeout Occurred (Cloudflare)524304 — HTTP 304 Not Modified (HTTP)304AttributeError — AttributeError: 'X' object has no attribute 'y' (Python)AttributeErrorConnectionRefusedError — ConnectionRefusedError: [Errno 111] Connection refused (Python)ConnectionRefusedEr…Event loop is closed — RuntimeError: Event loop is closed (Python)Event loop is closed

Directly related (12)

SIGSEGVLinux

Segmentation fault (core dumped)

A program accessed memory it wasn’t allowed to, and the kernel killed it with SIGSEGV (exit code 139).

0xC0000142Windows

The application was unable to start correctly (0xc0000142)

A DLL the program loads failed to initialise — often after an update, with corrupt runtimes, or when a desktop heap/session limit…

terminate called after throwing an instance ofC/C++

C++: terminate called after throwing an instance of 'std::out_of_range' — what(): vector::_M_range_check

A C++ exception wasn’t caught anywhere, so std::terminate aborted the program. what() tells you the reason.

Maximum function nestingPHP

Fatal error: Maximum function nesting level of '256' reached, aborting!

Recursion went deeper than Xdebug’s max_nesting_level allows (or PHP crashed with a segfault without Xdebug).

dyld: Library not loadediOS

dyld: Library not loaded: @rpath/X.framework/X — Reason: image not found (crash on launch)

A dynamic framework the app needs at runtime isn’t embedded in the app bundle, so it crashes at launch.

RangeErrorJavaScript

RangeError: Maximum call stack size exceeded

A function called itself (directly or indirectly) too many times — usually infinite recursion.

Illegal instructionLinux

Illegal instruction (core dumped) (SIGILL)

The program used a CPU instruction your processor doesn’t support — typically AVX/AVX2 in prebuilt binaries (TensorFlow, MongoDB…

double free or corruptionC/C++

C/C++: free(): double free detected / double free or corruption (out) — Aborted (core dumped)

Memory was freed twice or the heap was corrupted (buffer overflow, freeing a non-heap pointer), so glibc aborted the program.

StackOverflowErrorJava

java.lang.StackOverflowError

The thread’s call stack overflowed — almost always unbounded recursion, sometimes a bidirectional toString/equals/JSON cycle.

recursion limitSQL

Msg 530: The statement terminated. The maximum recursion 100 has been exhausted before statement completion. / MySQL 3636 Recursive query aborted after 1001 iterations

A recursive CTE exceeded the database’s recursion limit — often an infinite loop in hierarchical data.

OutOfMemoryException.NET

System.OutOfMemoryException: Exception of type 'System.OutOfMemoryException' was thrown

The process couldn’t allocate memory — large in-memory data, leaks, 32-bit process limits, or container memory limits.

RecursionErrorPython

RecursionError: maximum recursion depth exceeded

A function called itself (directly or indirectly) more than ~1000 times.

Two steps away (33)

CrashLoopBackOffKubernetes

Kubernetes: CrashLoopBackOff

The container starts, crashes (or exits), and Kubernetes keeps restarting it with increasing back-off delays.

OOM killerLinux

Killed / Out of memory: Killed process (Linux OOM killer)

The kernel ran out of memory and killed a process to recover — the program just prints “Killed” (exit code 137).

invalid string lengthJavaScript

RangeError: Invalid string length

A string grew beyond the engine’s maximum length — usually runaway concatenation or huge JSON.stringify output.

0xC000007BWindows

The application was unable to start correctly (0xc000007b)

A program loaded a DLL of the wrong architecture (32-bit vs 64-bit) or a corrupted runtime library.

VCRUNTIME140.dllWindows

VCRUNTIME140.dll was not found / MSVCP140.dll is missing

The program needs the Microsoft Visual C++ 2015–2022 Redistributable, which isn’t installed (or is damaged).

Unexpectedly found niliOS

Fatal error: Unexpectedly found nil while unwrapping an Optional value

Swift force-unwrapped (`!`) an optional that was nil, crashing the app.

IllegalArgumentExceptionJava

java.lang.IllegalArgumentException

A method rejected an argument value as invalid.

IllegalStateExceptionJava

java.lang.IllegalStateException

A method was called when the object wasn’t in the right state for it.

ArithmeticExceptionJava

java.lang.ArithmeticException: / by zero

Integer division or modulo by zero.

Allowed memory size exhaustedPHP

PHP Fatal error: Allowed memory size of X bytes exhausted

The script tried to use more memory than PHP’s `memory_limit` allows.

Call to undefined functionPHP

PHP Fatal error: Uncaught Error: Call to undefined function

PHP can’t find the function you called — usually a missing extension, missing include, or namespace issue.

Cannot redeclarePHP

Fatal error: Cannot redeclare function foo() (previously declared in …)

The same function (or class) was defined twice — usually a file included more than once.

error while loading shared librariesLinux

error while loading shared libraries: libX.so.N: cannot open shared object file: No such file or directory

The program needs a shared library (.so) that isn’t installed or isn’t on the loader’s search path.

EXC_BAD_ACCESSiOS

Thread 1: EXC_BAD_ACCESS (code=1, address=0x0)

The app accessed memory it shouldn’t — a dangling pointer, released object, unsafe pointer misuse, a data race, or infinite recur…

SIGABRTiOS

Thread 1: signal SIGABRT (app crashes with "libc++abi: terminating")

The app deliberately aborted — an uncaught exception, failed assertion or fatalError. The console above the crash has the real me…

Too many re-rendersReact

Error: Too many re-renders. React limits the number of renders to prevent an infinite loop.

A state update runs during render, which triggers another render, which updates state again — forever.

JsonException object cycle.NET

JsonException: A possible object cycle was detected

System.Text.Json found a reference loop (e.g. Order → Customer → Orders → …) while serialising, usually from EF Core navigation p…

TypeError set undefinedJavaScript

TypeError: Cannot set properties of undefined (setting 'x')

Code assigned a property on a value that is undefined (or null).

exec format errorDocker

exec /usr/local/bin/docker-entrypoint.sh: exec format error

The container tried to run a binary built for a different CPU architecture (arm64 vs amd64) — or a script with a broken shebang /…

recovery modePostgreSQL

FATAL: the database system is in recovery mode

PostgreSQL crashed (often OOM-killed) and is replaying WAL to recover.

no matching manifestDocker

no matching manifest for linux/arm64/v8 in the manifest list entries

The image has no build for your CPU architecture — typically pulling an amd64-only image on an Apple Silicon Mac or ARM server.

OOMKilledKubernetes

Kubernetes: OOMKilled (exit code 137)

The container used more memory than its limit, and the kernel killed it.

OutOfMemoryErrorJava

java.lang.OutOfMemoryError: Java heap space

The JVM ran out of heap memory and garbage collection couldn’t free enough.

MEMORY_MANAGEMENTWindows

Blue Screen: MEMORY_MANAGEMENT (Stop code 0x0000001A)

Windows detected a severe memory-management error — commonly faulty RAM, unstable memory settings or a bad driver.

GROUP BYSQL

Column must appear in the GROUP BY clause / isn't in GROUP BY (MySQL 1055 only_full_group_by)

You selected a column that is neither grouped nor aggregated, so the result would be ambiguous.

aggregate in WHERESQL

ERROR: aggregate functions are not allowed in WHERE (use HAVING) / MySQL 1111 Invalid use of group function

An aggregate (SUM, COUNT, AVG) was used in WHERE, which filters rows before grouping.

1136SQL

MySQL ERROR 1136 (21S01): Column count doesn't match value count at row 1

An INSERT supplies a different number of values than columns.

504HTTP

HTTP 504 Gateway Timeout

A proxy or gateway waited too long for the upstream server to respond and gave up.

524Cloudflare

Cloudflare Error 524: A Timeout Occurred

Cloudflare connected to the origin, but the origin didn’t send an HTTP response within 100 seconds.

304HTTP

HTTP 304 Not Modified

The cached copy is still valid, so the server sends no body and the client reuses its cache.

AttributeErrorPython

AttributeError: 'X' object has no attribute 'y'

You accessed an attribute or method that doesn’t exist on that object type.

ConnectionRefusedErrorPython

ConnectionRefusedError: [Errno 111] Connection refused

Nothing is listening on the host/port Python tried to connect to.

Event loop is closedPython

RuntimeError: Event loop is closed

Async code tried to use an event loop that has already been shut down.