Error map

0xC0000142 The application was unable to start correctly (0xc0000142)

Windows · layer 6, Platform & cloud

Open the full error page →

Centre: this error. First ring: errors it is linked with (12). Outer ring: what those are linked with. Colours show the layer of a request each error belongs to. Click any dot to re-centre the map on it; hover to follow its connections. The centre dot opens the error page.

0xC0000142 — The application was unable to start correctly (0xc0000142) (Windows)0xC00001420xC000007B — The application was unable to start correctly (0xc000007b) (Windows)0xC000007BSIGSEGV — Segmentation fault (core dumped) (Linux)SIGSEGVterminate called after throwing an instance of — C++: terminate called after throwing an instance of 'std::out_of_range' — what(): vector::_M_range_check (C/C++)terminate called af…dyld: Library not loaded — dyld: Library not loaded: @rpath/X.framework/X — Reason: image not found (crash on launch) (iOS)dyld: Library not l…Illegal instruction — Illegal instruction (core dumped) (SIGILL) (Linux)Illegal instruction0x8007007E — 0x8007007E: The specified module could not be found (Windows)0x8007007Edouble free or corruption — C/C++: free(): double free detected / double free or corruption (out) — Aborted (core dumped) (C/C++)double free or corr…0xC0000005 — The application was unable to start correctly (0xc0000005) / Exception code 0xc0000005 access violation (Windows)0xC0000005VCRUNTIME140.dll — VCRUNTIME140.dll was not found / MSVCP140.dll is missing (Windows)VCRUNTIME140.dllUnexpectedly found nil — Fatal error: Unexpectedly found nil while unwrapping an Optional value (iOS)Unexpectedly found …recovery mode — FATAL: the database system is in recovery mode (PostgreSQL)recovery modeapi-ms-win-crt-runtime-l1-1-0.dll — The program can't start because api-ms-win-crt-runtime-l1-1-0.dll is missing from your computer (Windows)api-ms-win-crt-runt…0x80070643 — Windows Error 0x80070643: Fatal error during installation (Windows)0x80070643FileNotFoundException assembly — Could not load file or assembly 'X, Version=…' or one of its dependencies (.NET)FileNotFoundExcepti…This app can't run on your PC — This app can't run on your PC — To find a version for your PC, check with the software publisher (Windows)This app can't run …CrashLoopBackOff — Kubernetes: CrashLoopBackOff (Kubernetes)CrashLoopBackOffRangeError — RangeError: Maximum call stack size exceeded (JavaScript)RangeErrorOOM killer — Killed / Out of memory: Killed process (Linux OOM killer) (Linux)OOM killerIllegalArgumentException — java.lang.IllegalArgumentException (Java)IllegalArgumentExce…IllegalStateException — java.lang.IllegalStateException (Java)IllegalStateExcepti…ArithmeticException — java.lang.ArithmeticException: / by zero (Java)ArithmeticExceptionerror while loading shared libraries — error while loading shared libraries: libX.so.N: cannot open shared object file: No such file or directory (Linux)error while loading…Stack overflow — .NET: Stack overflow. / Process is terminated due to StackOverflowException (.NET)Stack overflowEXC_BAD_ACCESS — Thread 1: EXC_BAD_ACCESS (code=1, address=0x0) (iOS)EXC_BAD_ACCESSexec format error — exec /usr/local/bin/docker-entrypoint.sh: exec format error (Docker)exec format errorno matching manifest — no matching manifest for linux/arm64/v8 in the manifest list entries (Docker)no matching manifestcannot execute binary file — cannot execute binary file: Exec format error (Linux)cannot execute bina…ERESOLVE — npm ERR! code ERESOLVE — unable to resolve dependency tree (npm)ERESOLVEMODULE_NOT_FOUND — Error: Cannot find module 'x' (MODULE_NOT_FOUND) (Node.js)MODULE_NOT_FOUNDCould not resolve — Gradle: Could not resolve all files for configuration / Could not resolve dependency (Android)Could not resolveOOMKilled — Kubernetes: OOMKilled (exit code 137) (Kubernetes)OOMKilledOutOfMemoryError — java.lang.OutOfMemoryError: Java heap space (Java)OutOfMemoryErrorMEMORY_MANAGEMENT — Blue Screen: MEMORY_MANAGEMENT (Stop code 0x0000001A) (Windows)MEMORY_MANAGEMENTheap out of memory — FATAL ERROR: Reached heap limit Allocation failed - JavaScript heap out of memory (Node.js)heap out of memoryinvalid string length — RangeError: Invalid string length (JavaScript)invalid string leng…MaxListenersExceededWarning — MaxListenersExceededWarning: Possible EventEmitter memory leak detected. 11 listeners added (Node.js)MaxListenersExceede…ModuleNotFoundError — ModuleNotFoundError: No module named 'x' (Python)ModuleNotFoundErrorgyp ERR! — gyp ERR! build error / node-gyp rebuild failed (npm)gyp ERR!NullReferenceException — System.NullReferenceException: Object reference not set to an instance of an object (.NET)NullReferenceExcept…TypeError — TypeError: Cannot read properties of undefined (reading 'x') (JavaScript)TypeErrorNullPointerException — java.lang.NullPointerException (Java)NullPointerExceptionRuntime exited with error: signal: killed — Lambda: Runtime exited with error: signal: killed (Runtime.ExitError) (AWS)Runtime exited with…Cannot allocate memory — fork: Cannot allocate memory / ENOMEM (Linux)Cannot allocate mem…Gradle Java heap space — Gradle: Expiring Daemon because JVM heap space is exhausted / java.lang.OutOfMemoryError: Java heap space during build (Android)Gradle Java heap sp…0x80070005 — Windows Error 0x80070005 (E_ACCESSDENIED): Access is denied (Windows)0x800700050x80070002 — Windows Error 0x80070002: The system cannot find the file specified (Windows)0x800700020x80004005 — Windows Error 0x80004005 (E_FAIL): Unspecified error (Windows)0x80004005

Directly related (12)

0xC000007BWindows

The application was unable to start correctly (0xc000007b)

A program loaded a DLL of the wrong architecture (32-bit vs 64-bit) or a corrupted runtime library.

SIGSEGVLinux

Segmentation fault (core dumped)

A program accessed memory it wasn’t allowed to, and the kernel killed it with SIGSEGV (exit code 139).

terminate called after throwing an instance ofC/C++

C++: terminate called after throwing an instance of 'std::out_of_range' — what(): vector::_M_range_check

A C++ exception wasn’t caught anywhere, so std::terminate aborted the program. what() tells you the reason.

dyld: Library not loadediOS

dyld: Library not loaded: @rpath/X.framework/X — Reason: image not found (crash on launch)

A dynamic framework the app needs at runtime isn’t embedded in the app bundle, so it crashes at launch.

Illegal instructionLinux

Illegal instruction (core dumped) (SIGILL)

The program used a CPU instruction your processor doesn’t support — typically AVX/AVX2 in prebuilt binaries (TensorFlow, MongoDB…

0x8007007EWindows

0x8007007E: The specified module could not be found

A DLL that a program, driver or COM component needs isn’t on disk or on the DLL search path.

double free or corruptionC/C++

C/C++: free(): double free detected / double free or corruption (out) — Aborted (core dumped)

Memory was freed twice or the heap was corrupted (buffer overflow, freeing a non-heap pointer), so glibc aborted the program.

0xC0000005Windows

The application was unable to start correctly (0xc0000005) / Exception code 0xc0000005 access violation

A program tried to read or write memory it doesn’t own and Windows stopped it — buggy software, bad drivers/plugins, security sof…

VCRUNTIME140.dllWindows

VCRUNTIME140.dll was not found / MSVCP140.dll is missing

The program needs the Microsoft Visual C++ 2015–2022 Redistributable, which isn’t installed (or is damaged).

Unexpectedly found niliOS

Fatal error: Unexpectedly found nil while unwrapping an Optional value

Swift force-unwrapped (`!`) an optional that was nil, crashing the app.

recovery modePostgreSQL

FATAL: the database system is in recovery mode

PostgreSQL crashed (often OOM-killed) and is replaying WAL to recover.

api-ms-win-crt-runtime-l1-1-0.dllWindows

The program can't start because api-ms-win-crt-runtime-l1-1-0.dll is missing from your computer

The Universal C Runtime (UCRT) isn’t installed — usually on older Windows 7/8.1 machines missing the KB2999226 update.

Two steps away (35)

0x80070643Windows

Windows Error 0x80070643: Fatal error during installation

An MSI-based installer or update (often Defender definitions, .NET or the WinRE update KB5034441) failed during installation.

FileNotFoundException assembly.NET

Could not load file or assembly 'X, Version=…' or one of its dependencies

The runtime couldn’t find or load a referenced DLL — missing from the output, wrong version, or wrong platform (x86/x64).

This app can't run on your PCWindows

This app can't run on your PC — To find a version for your PC, check with the software publisher

The program was built for another architecture (32/64-bit, ARM) or is blocked by S mode/compatibility, or the file is corrupt.

CrashLoopBackOffKubernetes

Kubernetes: CrashLoopBackOff

The container starts, crashes (or exits), and Kubernetes keeps restarting it with increasing back-off delays.

RangeErrorJavaScript

RangeError: Maximum call stack size exceeded

A function called itself (directly or indirectly) too many times — usually infinite recursion.

OOM killerLinux

Killed / Out of memory: Killed process (Linux OOM killer)

The kernel ran out of memory and killed a process to recover — the program just prints “Killed” (exit code 137).

IllegalArgumentExceptionJava

java.lang.IllegalArgumentException

A method rejected an argument value as invalid.

IllegalStateExceptionJava

java.lang.IllegalStateException

A method was called when the object wasn’t in the right state for it.

ArithmeticExceptionJava

java.lang.ArithmeticException: / by zero

Integer division or modulo by zero.

error while loading shared librariesLinux

error while loading shared libraries: libX.so.N: cannot open shared object file: No such file or directory

The program needs a shared library (.so) that isn’t installed or isn’t on the loader’s search path.

Stack overflow.NET

.NET: Stack overflow. / Process is terminated due to StackOverflowException

Infinite or very deep recursion exhausted the thread’s stack; .NET can’t catch it and terminates the process.

EXC_BAD_ACCESSiOS

Thread 1: EXC_BAD_ACCESS (code=1, address=0x0)

The app accessed memory it shouldn’t — a dangling pointer, released object, unsafe pointer misuse, a data race, or infinite recur…

exec format errorDocker

exec /usr/local/bin/docker-entrypoint.sh: exec format error

The container tried to run a binary built for a different CPU architecture (arm64 vs amd64) — or a script with a broken shebang /…

no matching manifestDocker

no matching manifest for linux/arm64/v8 in the manifest list entries

The image has no build for your CPU architecture — typically pulling an amd64-only image on an Apple Silicon Mac or ARM server.

cannot execute binary fileLinux

cannot execute binary file: Exec format error

The program was built for a different CPU architecture or OS — e.g. an x86_64 binary on an ARM machine (Raspberry Pi, Graviton, A…

ERESOLVEnpm

npm ERR! code ERESOLVE — unable to resolve dependency tree

npm 7+ found conflicting peer dependency requirements and refuses to install a broken tree.

MODULE_NOT_FOUNDNode.js

Error: Cannot find module 'x' (MODULE_NOT_FOUND)

Node can’t resolve the module path — the package isn’t installed, or a relative path/extension is wrong.

Could not resolveAndroid

Gradle: Could not resolve all files for configuration / Could not resolve dependency

Gradle couldn’t download a dependency — wrong coordinates/version, missing repository, offline mode, or network/proxy issues.

OOMKilledKubernetes

Kubernetes: OOMKilled (exit code 137)

The container used more memory than its limit, and the kernel killed it.

OutOfMemoryErrorJava

java.lang.OutOfMemoryError: Java heap space

The JVM ran out of heap memory and garbage collection couldn’t free enough.

MEMORY_MANAGEMENTWindows

Blue Screen: MEMORY_MANAGEMENT (Stop code 0x0000001A)

Windows detected a severe memory-management error — commonly faulty RAM, unstable memory settings or a bad driver.

heap out of memoryNode.js

FATAL ERROR: Reached heap limit Allocation failed - JavaScript heap out of memory

The V8 heap hit its limit — a large build (webpack, tsc, Next.js) needs more memory, or the app leaks.

invalid string lengthJavaScript

RangeError: Invalid string length

A string grew beyond the engine’s maximum length — usually runaway concatenation or huge JSON.stringify output.

MaxListenersExceededWarningNode.js

MaxListenersExceededWarning: Possible EventEmitter memory leak detected. 11 listeners added

More than 10 listeners were added to one event — often a leak where listeners are added repeatedly.

ModuleNotFoundErrorPython

ModuleNotFoundError: No module named 'x'

Python can’t find the module you import — it isn’t installed in the interpreter/virtualenv that’s running, or the import path is…

gyp ERR!npm

gyp ERR! build error / node-gyp rebuild failed

A dependency with native C/C++ code couldn’t compile — missing build tools, Python, or an unsupported Node version.

NullReferenceException.NET

System.NullReferenceException: Object reference not set to an instance of an object

Code dereferenced a variable that is `null` — the .NET equivalent of Java’s NullPointerException.

TypeErrorJavaScript

TypeError: Cannot read properties of undefined (reading 'x')

You tried to access a property on a value that is `undefined` (or `null`) — usually data that hasn’t loaded yet or a wrong proper…

NullPointerExceptionJava

java.lang.NullPointerException

Code called a method or accessed a field on a reference that is `null`.

Runtime exited with error: signal: killedAWS

Lambda: Runtime exited with error: signal: killed (Runtime.ExitError)

The function process was killed — almost always because it ran out of its configured memory.

Cannot allocate memoryLinux

fork: Cannot allocate memory / ENOMEM

The kernel refused a memory allocation — RAM and swap are exhausted, or overcommit/cgroup limits block it.

Gradle Java heap spaceAndroid

Gradle: Expiring Daemon because JVM heap space is exhausted / java.lang.OutOfMemoryError: Java heap space during build

The Gradle daemon (or Kotlin daemon) ran out of memory compiling or dexing the project.

0x80070005Windows

Windows Error 0x80070005 (E_ACCESSDENIED): Access is denied

Windows refused an operation because the account or process lacks permission — seen in Windows Update, installers, Task Scheduler…

0x80070002Windows

Windows Error 0x80070002: The system cannot find the file specified

A file or registry entry Windows expected is missing — common in Windows Update, backups and app installs.

0x80004005Windows

Windows Error 0x80004005 (E_FAIL): Unspecified error

A generic failure code — the operation failed for a reason the component didn’t report precisely. Context decides the fix.