Error map

VCRUNTIME140.dll VCRUNTIME140.dll was not found / MSVCP140.dll is missing

Windows · layer 6, Platform & cloud

Open the full error page →

Centre: this error. First ring: errors it is linked with (6). Outer ring: what those are linked with. Colours show the layer of a request each error belongs to. Click any dot to re-centre the map on it; hover to follow its connections. The centre dot opens the error page.

VCRUNTIME140.dll — VCRUNTIME140.dll was not found / MSVCP140.dll is missing (Windows)VCRUNTIME14…0xC000007B — The application was unable to start correctly (0xc000007b) (Windows)0xC000007BModuleNotFoundError — ModuleNotFoundError: No module named 'x' (Python)ModuleNotFoundErrorgyp ERR! — gyp ERR! build error / node-gyp rebuild failed (npm)gyp ERR!0xC0000142 — The application was unable to start correctly (0xc0000142) (Windows)0xC00001420x8007007E — 0x8007007E: The specified module could not be found (Windows)0x8007007Eapi-ms-win-crt-runtime-l1-1-0.dll — The program can't start because api-ms-win-crt-runtime-l1-1-0.dll is missing from your computer (Windows)api-ms-win-crt-runt…0x80070643 — Windows Error 0x80070643: Fatal error during installation (Windows)0x80070643FileNotFoundException assembly — Could not load file or assembly 'X, Version=…' or one of its dependencies (.NET)FileNotFoundExcepti…0xC0000005 — The application was unable to start correctly (0xc0000005) / Exception code 0xc0000005 access violation (Windows)0xC0000005MODULE_NOT_FOUND — Error: Cannot find module 'x' (MODULE_NOT_FOUND) (Node.js)MODULE_NOT_FOUNDClass not found — PHP Fatal error: Uncaught Error: Class "X" not found (PHP)Class not foundImportError — ImportError: cannot import name 'x' from 'y' (Python)ImportErrorELIFECYCLE — npm ERR! code ELIFECYCLE / Command failed with exit code 1 (npm)ELIFECYCLEERR_OSSL_EVP_UNSUPPORTED — Error: error:0308010C:digital envelope routines::unsupported (Node.js)ERR_OSSL_EVP_UNSUPP…node-sass — Error: Node Sass does not yet support your current environment (Node.js)node-sassSIGSEGV — Segmentation fault (core dumped) (Linux)SIGSEGVUnexpectedly found nil — Fatal error: Unexpectedly found nil while unwrapping an Optional value (iOS)Unexpectedly found …recovery mode — FATAL: the database system is in recovery mode (PostgreSQL)recovery modeERESOLVE — npm ERR! code ERESOLVE — unable to resolve dependency tree (npm)ERESOLVECould not resolve — Gradle: Could not resolve all files for configuration / Could not resolve dependency (Android)Could not resolveClassNotFoundException — java.lang.ClassNotFoundException / NoClassDefFoundError (Java)ClassNotFoundExcept…0x80070005 — Windows Error 0x80070005 (E_ACCESSDENIED): Access is denied (Windows)0x800700050x80070002 — Windows Error 0x80070002: The system cannot find the file specified (Windows)0x800700020x80004005 — Windows Error 0x80004005 (E_FAIL): Unspecified error (Windows)0x80004005

Directly related (6)

Two steps away (18)

0x80070643Windows

Windows Error 0x80070643: Fatal error during installation

An MSI-based installer or update (often Defender definitions, .NET or the WinRE update KB5034441) failed during installation.

FileNotFoundException assembly.NET

Could not load file or assembly 'X, Version=…' or one of its dependencies

The runtime couldn’t find or load a referenced DLL — missing from the output, wrong version, or wrong platform (x86/x64).

0xC0000005Windows

The application was unable to start correctly (0xc0000005) / Exception code 0xc0000005 access violation

A program tried to read or write memory it doesn’t own and Windows stopped it — buggy software, bad drivers/plugins, security sof…

MODULE_NOT_FOUNDNode.js

Error: Cannot find module 'x' (MODULE_NOT_FOUND)

Node can’t resolve the module path — the package isn’t installed, or a relative path/extension is wrong.

Class not foundPHP

PHP Fatal error: Uncaught Error: Class "X" not found

PHP couldn’t load the class — autoloading failed, the namespace is wrong, or the dependency isn’t installed.

ImportErrorPython

ImportError: cannot import name 'x' from 'y'

The module was found, but the name you’re importing from it doesn’t exist — usually a version change or a circular import.

ELIFECYCLEnpm

npm ERR! code ELIFECYCLE / Command failed with exit code 1

An npm script (build, start, test, postinstall) exited with an error. ELIFECYCLE is only the wrapper — the real error is printed…

ERR_OSSL_EVP_UNSUPPORTEDNode.js

Error: error:0308010C:digital envelope routines::unsupported

An old build tool (webpack 4, old react-scripts) uses a hash algorithm that OpenSSL 3 in Node 17+ disables.

node-sassNode.js

Error: Node Sass does not yet support your current environment

node-sass (deprecated) has no binary for your Node version/OS.

SIGSEGVLinux

Segmentation fault (core dumped)

A program accessed memory it wasn’t allowed to, and the kernel killed it with SIGSEGV (exit code 139).

Unexpectedly found niliOS

Fatal error: Unexpectedly found nil while unwrapping an Optional value

Swift force-unwrapped (`!`) an optional that was nil, crashing the app.

recovery modePostgreSQL

FATAL: the database system is in recovery mode

PostgreSQL crashed (often OOM-killed) and is replaying WAL to recover.

ERESOLVEnpm

npm ERR! code ERESOLVE — unable to resolve dependency tree

npm 7+ found conflicting peer dependency requirements and refuses to install a broken tree.

Could not resolveAndroid

Gradle: Could not resolve all files for configuration / Could not resolve dependency

Gradle couldn’t download a dependency — wrong coordinates/version, missing repository, offline mode, or network/proxy issues.

ClassNotFoundExceptionJava

java.lang.ClassNotFoundException / NoClassDefFoundError

The JVM couldn’t find a class on the classpath at runtime.

0x80070005Windows

Windows Error 0x80070005 (E_ACCESSDENIED): Access is denied

Windows refused an operation because the account or process lacks permission — seen in Windows Update, installers, Task Scheduler…

0x80070002Windows

Windows Error 0x80070002: The system cannot find the file specified

A file or registry entry Windows expected is missing — common in Windows Update, backups and app installs.

0x80004005Windows

Windows Error 0x80004005 (E_FAIL): Unspecified error

A generic failure code — the operation failed for a reason the component didn’t report precisely. Context decides the fix.