Error map
no matching manifest no matching manifest for linux/arm64/v8 in the manifest list entries
Docker · layer 6, Platform & cloud
Centre: this error. First ring: errors it is linked with (12). Outer ring: what those are linked with. Colours show the layer of a request each error belongs to. Click any dot to re-centre the map on it; hover to follow its connections. The centre dot opens the error page.
Directly related (12)
Cloudflare Error 1011: Access denied (Hotlinking denied)
An image or file is being loaded from another site, and Cloudflare Hotlink Protection blocked it.
pull access denied for image, repository does not exist or may require 'docker login'
Docker couldn’t pull the image: the name or tag is wrong, the repository is private and you’re not logged in, or it doesn’t exist…
Azure VM: OSProvisioningTimedOut — OS Provisioning for VM did not finish in the allotted time
The VM booted but its guest agent didn’t report provisioning success in time — usually a generalisation problem with a custom ima…
manifest for image:tag not found: manifest unknown
The repository exists, but the tag you asked for doesn’t — it was never pushed, was deleted, or is misspelled.
cannot execute binary file: Exec format error
The program was built for a different CPU architecture or OS — e.g. an x86_64 binary on an ARM machine (Raspberry Pi, Graviton, A…
Illegal instruction (core dumped) (SIGILL)
The program used a CPU instruction your processor doesn’t support — typically AVX/AVX2 in prebuilt binaries (TensorFlow, MongoDB…
exec /usr/local/bin/docker-entrypoint.sh: exec format error
The container tried to run a binary built for a different CPU architecture (arm64 vs amd64) — or a script with a broken shebang /…
conflict: unable to remove repository reference (must force) - container is using its referenced image
You tried to delete an image that a container — even a stopped one — still uses.
conflict: unable to delete image (cannot be forced) - image has dependent child images
Other images were built on top of this one, so Docker won’t delete it by ID.
docker: invalid reference format (repository name must be lowercase)
Docker couldn’t parse the image name — uppercase letters, spaces, an empty variable, or a misplaced option.
INSTALL_FAILED_NO_MATCHING_ABIS: Failed to extract native libraries
The APK contains native (.so) libraries only for CPU architectures the device doesn’t support — e.g. x86 emulator with arm-only l…
PlatformNotSupportedException: System.Drawing.Common is not supported on this platform
Since .NET 6, System.Drawing.Common only works on Windows; on Linux/macOS (including Docker) it throws.
Two steps away (32)
Kubernetes: ImagePullBackOff / ErrImagePull
The node can’t pull the container image — wrong name/tag, missing registry credentials, or registry unreachable.
HTTP 403 Forbidden
The server understood the request but refuses to authorize it — you (or the server process) are not allowed to access this resour…
Cloudflare Error 1020: Access Denied
A Cloudflare firewall/WAF custom rule blocked the request — the visitor’s IP, country, user agent or request pattern matched a bl…
denied: Your authorization token has expired. Reauthenticate and try again. (Amazon ECR)
Docker’s login to Amazon ECR has expired — ECR tokens last 12 hours, so pushes and pulls fail until you log in again.
toomanyrequests: You have reached your pull rate limit (Docker Hub)
Docker Hub limits anonymous and free pulls; your IP or account has used its quota for the current window.
unauthorized: authentication required (docker push / pull)
The registry needs credentials for this operation and the request had none or had expired ones.
Fatal error: Uncaught Error: Call to undefined function imagecreatefromjpeg()
The GD extension (or its JPEG/WebP support) isn’t installed for the PHP version serving the site.
Error: Invalid src prop on `next/image`, hostname "x" is not configured under images in your `next.config.js`
next/image refuses to optimize images from domains not allowed in next.config.js.
EC2 status check failed: Instance reachability check failed (1/2 checks passed)
AWS can reach the host, but the operating system inside the instance isn’t responding — kernel panic, full disk, broken network c…
denied: requested access to the resource is denied (docker push)
You’re logged in, but not allowed to push to that repository — usually the image isn’t tagged with your own username/organisation.
Get "https://registry-1.docker.io/v2/": net/http: request canceled while waiting for connection (Client.Timeout exceeded)
Docker couldn’t reach the registry in time — a network, DNS, proxy or firewall problem between your machine and the registry.
x509: certificate signed by unknown authority (docker pull/login)
The registry’s TLS certificate isn’t trusted by the Docker daemon — a private CA, self-signed certificate, or a TLS-inspecting co…
Text file busy (ETXTBSY) when replacing or running a binary
You tried to overwrite an executable that is currently running, or run one that is still open for writing.
error while loading shared libraries: libX.so.N: cannot open shared object file: No such file or directory
The program needs a shared library (.so) that isn’t installed or isn’t on the loader’s search path.
/lib/x86_64-linux-gnu/libc.so.6: version `GLIBC_2.34' not found
The binary was built on a newer Linux than the one you run it on, and needs a newer glibc than your system has.
Segmentation fault (core dumped)
A program accessed memory it wasn’t allowed to, and the kernel killed it with SIGSEGV (exit code 139).
Fatal error: Unexpectedly found nil while unwrapping an Optional value
Swift force-unwrapped (`!`) an optional that was nil, crashing the app.
FATAL: the database system is in recovery mode
PostgreSQL crashed (often OOM-killed) and is replaying WAL to recover.
Kubernetes: CrashLoopBackOff
The container starts, crashes (or exits), and Kubernetes keeps restarting it with increasing back-off delays.
bash: command not found
The shell can’t find an executable with that name in any directory on your PATH.
COPY failed: file not found in build context / "/app/x": not found
The Dockerfile COPY refers to a path outside the build context, excluded by .dockerignore, or relative to the wrong directory.
no space left on device (Docker / Linux)
The disk (or inode table) is full — Docker images, build cache, logs and volumes are common culprits.
Error response from daemon: max depth exceeded (too many image layers)
The image has more layers than the storage driver allows (127 for overlay2), usually from repeatedly committing containers or ver…
Error response from daemon: Container X is not running
You tried to exec into or interact with a container that has stopped.
docker-compose: command not found / 'compose' is not a docker command
Your system has only one of the two Compose flavours: the old docker-compose (v1) binary or the newer docker compose (v2) plugin.
the input device is not a TTY
docker run/exec was called with -t (allocate a terminal) in a context with no terminal — CI, cron, a pipe or a script.
INSTALL_FAILED_INSUFFICIENT_STORAGE: Failure [INSTALL_FAILED_INSUFFICIENT_STORAGE]
The device or emulator doesn’t have enough free internal storage to install the APK.
INSTALL_FAILED_OLDER_SDK / INSTALL_FAILED_DEPRECATED_SDK_VERSION
The device’s Android version is lower than the app’s minSdk (OLDER_SDK), or the app’s targetSdk is too old for this Android versi…
INSTALL_FAILED_TEST_ONLY: installPackageLI
The APK is marked testOnly (built by Android Studio’s Run button), so normal installs refuse it.
Could not load file or assembly 'X, Version=…' or one of its dependencies
The runtime couldn’t find or load a referenced DLL — missing from the output, wrong version, or wrong platform (x86/x64).
Pod status InvalidImageName: couldn't parse image reference
The image field in the pod spec isn’t a valid image reference, so the kubelet can’t even try to pull it.
The framework 'Microsoft.NETCore.App', version '8.0.0' (x64) was not found. You must install or update .NET to run this application
The machine doesn’t have the .NET runtime version the app was built for (framework-dependent deployment).
Map another error
Popular: 4035004000xC000007BTypeErrorCritical error404NullPointerException