Error map

Cannot redeclare Fatal error: Cannot redeclare function foo() (previously declared in …)

PHP · layer 4, Application & API

Open the full error page →

Centre: this error. First ring: errors it is linked with (12). Outer ring: what those are linked with. Colours show the layer of a request each error belongs to. Click any dot to re-centre the map on it; hover to follow its connections. The centre dot opens the error page.

Cannot redeclare — Fatal error: Cannot redeclare function foo() (previously declared in …) (PHP)Cannot rede…Critical error — WordPress: There Has Been a Critical Error on This Website (WordPress)Critical errorParse error — PHP Parse error: syntax error, unexpected … (PHP)Parse errorCall to undefined function — PHP Fatal error: Uncaught Error: Call to undefined function (PHP)Call to undefined f…mysqli_sql_exception — Fatal error: Uncaught mysqli_sql_exception (PHP)mysqli_sql_exceptionMaximum execution time — PHP Fatal error: Maximum execution time of 30 seconds exceeded (PHP)Maximum execution t…TypeError — Fatal error: Uncaught TypeError: foo(): Argument #1 ($x) must be of type int, string given (PHP)TypeErrorDivisionByZeroError — Fatal error: Uncaught DivisionByZeroError: Division by zero (PHP)DivisionByZeroErrorUncaught Exception — Fatal error: Uncaught Exception: message in file.php:12 (PHP)Uncaught ExceptionCall to member function on null — Fatal error: Uncaught Error: Call to a member function x() on null (PHP)Call to member func…ArgumentCountError — Fatal error: Uncaught ArgumentCountError: Too few arguments to function foo(), 1 passed and exactly 2 expected (PHP)ArgumentCountErrorCall to undefined function (WordPress) — WordPress: Fatal error: Uncaught Error: Call to undefined function wp_get_current_user() / add_action() / get_header() (WordPress)Call to undefined f…Allowed memory size exhausted — PHP Fatal error: Allowed memory size of X bytes exhausted (PHP)Allowed memory size…500 — HTTP 500 Internal Server Error (HTTP)500DB connection — WordPress: Error Establishing a Database Connection (WordPress)DB connectionMaintenance mode — WordPress: Briefly unavailable for scheduled maintenance. Check back in a minute. (WordPress)Maintenance mode1064 — MySQL ERROR 1064 (42000): You have an error in your SQL syntax (MySQL)1064IndentationError — IndentationError: unexpected indent / expected an indented block (Python)IndentationErrorSyntaxError — SyntaxError: invalid syntax (Python)SyntaxErrorClass not found — PHP Fatal error: Uncaught Error: Class "X" not found (PHP)Class not foundHeaders already sent — Warning: Cannot modify header information - headers already sent (PHP)Headers already sentcould not find driver — PDOException: could not find driver (PHP)could not find driv…1062 — MySQL ERROR 1062 (23000): Duplicate entry for key (MySQL)1062Plugin could not be activated because it triggered a fatal error — WordPress: Plugin could not be activated because it triggered a fatal error (WordPress)Plugin could not be…504 — HTTP 504 Gateway Timeout (HTTP)504524 — Cloudflare Error 524: A Timeout Occurred (Cloudflare)524Link expired — WordPress: The link you followed has expired (WordPress)Link expiredArray to string conversion — Warning: Array to string conversion (PHP)Array to string con…Cannot use object as array — Fatal error: Uncaught Error: Cannot use object of type stdClass as array (PHP)Cannot use object a…Unsupported operand types — Fatal error: Uncaught TypeError: Unsupported operand types: string + int (PHP)Unsupported operand…Division by zero — SQL Error: division by zero / Divide by zero error encountered (SQL)Division by zeroZeroDivisionError — ZeroDivisionError: division by zero (Python)ZeroDivisionErrorIllegalStateException — java.lang.IllegalStateException (Java)IllegalStateExcepti…ArithmeticException — java.lang.ArithmeticException: / by zero (Java)ArithmeticExceptionNoSuchElementException — java.util.NoSuchElementException: No value present (Java)NoSuchElementExcept…NullReferenceException — System.NullReferenceException: Object reference not set to an instance of an object (.NET)NullReferenceExcept…NullPointerException — java.lang.NullPointerException (Java)NullPointerExceptionComposer memory — Composer: PHP Fatal error: Allowed memory size of 1610612736 bytes exhausted (PHP)Composer memoryMaximum function nesting — Fatal error: Maximum function nesting level of '256' reached, aborting! (PHP)Maximum function ne…Primary script unknown — FastCGI sent in stderr: "Primary script unknown" (PHP)Primary script unkn…42883 function — ERROR: function x(text) does not exist — No function matches the given name and argument types (PostgreSQL)42883 functionInstallation failed: Could not create directory — WordPress: Installation failed: Could not create directory (plugin/theme install or update) (WordPress)Installation failed…Please enter your FTP credentials — To perform the requested action, WordPress needs to access your web server. Please enter your FTP credentials to proceed (WordPress)Please enter your F…Destination folder already exists — WordPress: Destination folder already exists. Plugin installation failed (WordPress)Destination folder …OOMKilled — Kubernetes: OOMKilled (exit code 137) (Kubernetes)OOMKilled413 — HTTP 413 Content Too Large (Request Entity Too Large) (HTTP)413OutOfMemoryError — java.lang.OutOfMemoryError: Java heap space (Java)OutOfMemoryError

Directly related (12)

Critical errorWordPress

WordPress: There Has Been a Critical Error on This Website

A PHP fatal error (usually from a plugin or theme) stopped WordPress; the real error is in the debug log or recovery-mode email.

Parse errorPHP

PHP Parse error: syntax error, unexpected …

PHP can’t parse the file because of a syntax mistake — the real error is often on the line before the one reported.

Call to undefined functionPHP

PHP Fatal error: Uncaught Error: Call to undefined function

PHP can’t find the function you called — usually a missing extension, missing include, or namespace issue.

mysqli_sql_exceptionPHP

Fatal error: Uncaught mysqli_sql_exception

A MySQLi query or connection failed; since PHP 8.1 MySQLi throws exceptions by default.

Maximum execution timePHP

PHP Fatal error: Maximum execution time of 30 seconds exceeded

The script ran longer than `max_execution_time` and PHP stopped it.

TypeErrorPHP

Fatal error: Uncaught TypeError: foo(): Argument #1 ($x) must be of type int, string given

A function received a value of the wrong type for a typed parameter.

DivisionByZeroErrorPHP

Fatal error: Uncaught DivisionByZeroError: Division by zero

Code divided by zero (or used modulo by zero) — PHP 8 throws instead of warning.

Uncaught ExceptionPHP

Fatal error: Uncaught Exception: message in file.php:12

An exception was thrown and nothing caught it, so PHP stopped the script.

Call to member function on nullPHP

Fatal error: Uncaught Error: Call to a member function x() on null

Code called a method on a variable that is null instead of an object.

ArgumentCountErrorPHP

Fatal error: Uncaught ArgumentCountError: Too few arguments to function foo(), 1 passed and exactly 2 expected

A function was called with fewer arguments than it requires.

Call to undefined function (WordPress)WordPress

WordPress: Fatal error: Uncaught Error: Call to undefined function wp_get_current_user() / add_action() / get_header()

Code called a WordPress function before WordPress loaded, or a theme/plugin file was opened directly.

Allowed memory size exhaustedPHP

PHP Fatal error: Allowed memory size of X bytes exhausted

The script tried to use more memory than PHP’s `memory_limit` allows.

Two steps away (34)

500HTTP

HTTP 500 Internal Server Error

The server hit an unexpected condition — usually an unhandled exception or misconfiguration in the application.

DB connectionWordPress

WordPress: Error Establishing a Database Connection

WordPress can’t connect to its MySQL/MariaDB database with the credentials in wp-config.php, or the database server is down.

Maintenance modeWordPress

WordPress: Briefly unavailable for scheduled maintenance. Check back in a minute.

An update was interrupted and WordPress left its `.maintenance` file behind, so the site stays in maintenance mode.

1064MySQL

MySQL ERROR 1064 (42000): You have an error in your SQL syntax

MySQL couldn’t parse the query. The text after “near” shows where parsing failed.

IndentationErrorPython

IndentationError: unexpected indent / expected an indented block

Python’s block structure is broken — inconsistent indentation or mixed tabs and spaces.

SyntaxErrorPython

SyntaxError: invalid syntax

Python couldn’t parse the code. The caret (^) points at or just after the mistake.

Class not foundPHP

PHP Fatal error: Uncaught Error: Class "X" not found

PHP couldn’t load the class — autoloading failed, the namespace is wrong, or the dependency isn’t installed.

Headers already sentPHP

Warning: Cannot modify header information - headers already sent

You called `header()`, `setcookie()` or `session_start()` after output had already been sent to the browser.

could not find driverPHP

PDOException: could not find driver

The PDO driver for your database (pdo_mysql, pdo_pgsql, pdo_sqlite) isn’t installed or enabled.

1062MySQL

MySQL ERROR 1062 (23000): Duplicate entry for key

An INSERT/UPDATE would create a duplicate value in a PRIMARY or UNIQUE key.

Plugin could not be activated because it triggered a fatal errorWordPress

WordPress: Plugin could not be activated because it triggered a fatal error

Activating the plugin caused a PHP fatal error — usually PHP version incompatibility, a conflict with another plugin/theme, or mi…

504HTTP

HTTP 504 Gateway Timeout

A proxy or gateway waited too long for the upstream server to respond and gave up.

524Cloudflare

Cloudflare Error 524: A Timeout Occurred

Cloudflare connected to the origin, but the origin didn’t send an HTTP response within 100 seconds.

Link expiredWordPress

WordPress: The link you followed has expired

Usually an upload (theme, plugin, media) larger than PHP’s upload/post limits — WordPress receives an empty request and shows thi…

Array to string conversionPHP

Warning: Array to string conversion

An array was used where a string is expected — echoing it, concatenating it, or passing it to a string function.

Cannot use object as arrayPHP

Fatal error: Uncaught Error: Cannot use object of type stdClass as array

Code used array syntax (`$x['key']`) on an object.

Unsupported operand typesPHP

Fatal error: Uncaught TypeError: Unsupported operand types: string + int

An arithmetic or array operator was used with incompatible types (PHP 8 is stricter than PHP 7).

Division by zeroSQL

SQL Error: division by zero / Divide by zero error encountered

An expression divided by a value that was 0 for at least one row.

ZeroDivisionErrorPython

ZeroDivisionError: division by zero

A number was divided (or modulo’d) by zero.

IllegalStateExceptionJava

java.lang.IllegalStateException

A method was called when the object wasn’t in the right state for it.

ArithmeticExceptionJava

java.lang.ArithmeticException: / by zero

Integer division or modulo by zero.

NoSuchElementExceptionJava

java.util.NoSuchElementException: No value present

Code asked for an element that doesn’t exist — Optional.get() on empty, iterator.next() past the end, Scanner with no input.

NullReferenceException.NET

System.NullReferenceException: Object reference not set to an instance of an object

Code dereferenced a variable that is `null` — the .NET equivalent of Java’s NullPointerException.

NullPointerExceptionJava

java.lang.NullPointerException

Code called a method or accessed a field on a reference that is `null`.

Composer memoryPHP

Composer: PHP Fatal error: Allowed memory size of 1610612736 bytes exhausted

Composer ran out of memory while resolving or installing dependencies.

Maximum function nestingPHP

Fatal error: Maximum function nesting level of '256' reached, aborting!

Recursion went deeper than Xdebug’s max_nesting_level allows (or PHP crashed with a segfault without Xdebug).

Primary script unknownPHP

FastCGI sent in stderr: "Primary script unknown"

Nginx passed a script path to PHP-FPM that PHP-FPM couldn’t find — usually a wrong SCRIPT_FILENAME or root.

42883 functionPostgreSQL

ERROR: function x(text) does not exist — No function matches the given name and argument types

PostgreSQL found no function with that name and argument types — wrong types, missing extension, or schema not in search_path.

Installation failed: Could not create directoryWordPress

WordPress: Installation failed: Could not create directory (plugin/theme install or update)

WordPress can’t write to wp-content/plugins, themes or upgrade — ownership/permissions or disk space.

Please enter your FTP credentialsWordPress

To perform the requested action, WordPress needs to access your web server. Please enter your FTP credentials to proceed

WordPress can’t write directly to its files (ownership differs from the PHP user), so it falls back to asking for FTP details.

Destination folder already existsWordPress

WordPress: Destination folder already exists. Plugin installation failed

A folder with the plugin/theme’s name already exists in wp-content, usually from a failed or partial previous install.

OOMKilledKubernetes

Kubernetes: OOMKilled (exit code 137)

The container used more memory than its limit, and the kernel killed it.

413HTTP

HTTP 413 Content Too Large (Request Entity Too Large)

The request body is bigger than the server is willing to accept — usually a file upload over the configured limit.

OutOfMemoryErrorJava

java.lang.OutOfMemoryError: Java heap space

The JVM ran out of heap memory and garbage collection couldn’t free enough.