Error map

built for iOS, linking for simulator Building for iOS Simulator, but linking in object file built for iOS, for architecture arm64

iOS · layer 1, On your device

Open the full error page →

Centre: this error. First ring: errors it is linked with (11). Outer ring: what those are linked with. Colours show the layer of a request each error belongs to. Click any dot to re-centre the map on it; hover to follow its connections. The centre dot opens the error page.

built for iOS, linking for simulator — Building for iOS Simulator, but linking in object file built for iOS, for architecture arm64 (iOS)built for i…cannot execute binary file — cannot execute binary file: Exec format error (Linux)cannot execute bina…Illegal instruction — Illegal instruction (core dumped) (SIGILL) (Linux)Illegal instructionexec format error — exec /usr/local/bin/docker-entrypoint.sh: exec format error (Docker)exec format errorNSUnknownKeyException — NSUnknownKeyException: this class is not key value coding-compliant for the key x (iOS)NSUnknownKeyExcepti…unable to dequeue a cell with identifier — unable to dequeue a cell with identifier Cell - must register a nib or a class for the identifier or connect a prototype cell in a storyboard (iOS)unable to dequeue a…Unable to simultaneously satisfy constraints — Auto Layout: Unable to simultaneously satisfy constraints. Probably at least one of the constraints in the following list is one you don't want (iOS)Unable to simultane…undefined reference to — C/C++: undefined reference to `function' — collect2: error: ld returned 1 exit status (C/C++)undefined reference…no matching manifest — no matching manifest for linux/arm64/v8 in the manifest list entries (Docker)no matching manifestUndefined symbols for architecture — Undefined symbol(s) for architecture arm64 — linker command failed with exit code 1 (iOS)Undefined symbols f…library not found for -lPods — ld: library not found for -lPods-AppName / framework not found Pods_App (iOS)library not found f…not allowed to query for scheme — -canOpenURL: failed for URL: "x://" - error: "This app is not allowed to query for scheme x" (iOS)not allowed to quer…Text file busy — Text file busy (ETXTBSY) when replacing or running a binary (Linux)Text file busyerror while loading shared libraries — error while loading shared libraries: libX.so.N: cannot open shared object file: No such file or directory (Linux)error while loading…GLIBC_2.xx not found — /lib/x86_64-linux-gnu/libc.so.6: version `GLIBC_2.34' not found (Linux)GLIBC_2.xx not foundSIGSEGV — Segmentation fault (core dumped) (Linux)SIGSEGVUnexpectedly found nil — Fatal error: Unexpectedly found nil while unwrapping an Optional value (iOS)Unexpectedly found …recovery mode — FATAL: the database system is in recovery mode (PostgreSQL)recovery modeCrashLoopBackOff — Kubernetes: CrashLoopBackOff (Kubernetes)CrashLoopBackOffImagePullBackOff — Kubernetes: ImagePullBackOff / ErrImagePull (Kubernetes)ImagePullBackOffcommand not found — bash: command not found (Linux)command not foundATS — App Transport Security has blocked a cleartext HTTP resource load (iOS)ATSSIGABRT — Thread 1: signal SIGABRT (app crashes with "libc++abi: terminating") (iOS)SIGABRTMain Thread Checker — Main Thread Checker: UI API called on a background thread: -[UIView setNeedsLayout] (iOS)Main Thread CheckerCould not cast value of type — Swift: Could not cast value of type 'X' to 'Y' (iOS)Could not cast valu…integrity could not be verified — Unable to Install "App": This app cannot be installed because its integrity could not be verified (iOS)integrity could not…Cannot convert value of type — Swift: Cannot convert value of type 'X' to expected argument type 'Y' (iOS)Cannot convert valu…ELIFECYCLE — npm ERR! code ELIFECYCLE / Command failed with exit code 1 (npm)ELIFECYCLEgyp ERR! — gyp ERR! build error / node-gyp rebuild failed (npm)gyp ERR!COPY failed — COPY failed: file not found in build context / "/app/x": not found (Docker)COPY failedpull access denied — pull access denied for image, repository does not exist or may require 'docker login' (Docker)pull access deniedmanifest unknown — manifest for image:tag not found: manifest unknown (Docker)manifest unknownconflict: unable to remove repository reference — conflict: unable to remove repository reference (must force) - container is using its referenced image (Docker)conflict: unable to…Signing requires a development team — Signing for "App" requires a development team. Select a development team in the Signing & Capabilities editor (iOS)Signing requires a …No such module — Swift: No such module 'X' (module not found) (iOS)No such moduledyld: Library not loaded — dyld: Library not loaded: @rpath/X.framework/X — Reason: image not found (crash on launch) (iOS)dyld: Library not l…PhaseScriptExecution — Xcode: Command PhaseScriptExecution failed with a nonzero exit code (iOS)PhaseScriptExecutionCocoaPods compatible versions — CocoaPods could not find compatible versions for pod (iOS)CocoaPods compatibl…CDN: trunk URL couldn't be downloaded — [!] CDN: trunk URL couldn't be downloaded: https://cdn.cocoapods.org/... (iOS)CDN: trunk URL coul…ITMS-90683 — ITMS-90683: Missing purpose string in Info.plist (NSCameraUsageDescription etc.) (iOS)ITMS-90683attempted to access privacy-sensitive data without a usage description — This app has crashed because it attempted to access privacy-sensitive data without a usage description (iOS)attempted to access…

Directly related (11)

cannot execute binary fileLinux

cannot execute binary file: Exec format error

The program was built for a different CPU architecture or OS — e.g. an x86_64 binary on an ARM machine (Raspberry Pi, Graviton, A…

Illegal instructionLinux

Illegal instruction (core dumped) (SIGILL)

The program used a CPU instruction your processor doesn’t support — typically AVX/AVX2 in prebuilt binaries (TensorFlow, MongoDB…

exec format errorDocker

exec /usr/local/bin/docker-entrypoint.sh: exec format error

The container tried to run a binary built for a different CPU architecture (arm64 vs amd64) — or a script with a broken shebang /…

NSUnknownKeyExceptioniOS

NSUnknownKeyException: this class is not key value coding-compliant for the key x

A storyboard/XIB has a connection to an outlet or action that no longer exists in the class (renamed or deleted), or the view’s c…

unable to dequeue a cell with identifieriOS

unable to dequeue a cell with identifier Cell - must register a nib or a class for the identifier or connect a prototype cell in a storyboard

The table/collection view was asked for a reusable cell identifier that was never registered.

Unable to simultaneously satisfy constraintsiOS

Auto Layout: Unable to simultaneously satisfy constraints. Probably at least one of the constraints in the following list is one you don't want

Two or more Auto Layout constraints conflict; UIKit breaks one to recover and logs this message.

undefined reference toC/C++

C/C++: undefined reference to `function' — collect2: error: ld returned 1 exit status

The linker can’t find the definition of a function or variable that was declared and used.

no matching manifestDocker

no matching manifest for linux/arm64/v8 in the manifest list entries

The image has no build for your CPU architecture — typically pulling an amd64-only image on an Apple Silicon Mac or ARM server.

Undefined symbols for architectureiOS

Undefined symbol(s) for architecture arm64 — linker command failed with exit code 1

The linker can’t find the implementation of a symbol your code uses — a missing framework/library, a file not in the target, or a…

library not found for -lPodsiOS

ld: library not found for -lPods-AppName / framework not found Pods_App

The linker can’t find the CocoaPods library — usually because the .xcodeproj was opened instead of the .xcworkspace, or pods were…

not allowed to query for schemeiOS

-canOpenURL: failed for URL: "x://" - error: "This app is not allowed to query for scheme x"

The app called canOpenURL for a scheme not listed in LSApplicationQueriesSchemes in Info.plist.

Two steps away (29)

Text file busyLinux

Text file busy (ETXTBSY) when replacing or running a binary

You tried to overwrite an executable that is currently running, or run one that is still open for writing.

error while loading shared librariesLinux

error while loading shared libraries: libX.so.N: cannot open shared object file: No such file or directory

The program needs a shared library (.so) that isn’t installed or isn’t on the loader’s search path.

GLIBC_2.xx not foundLinux

/lib/x86_64-linux-gnu/libc.so.6: version `GLIBC_2.34' not found

The binary was built on a newer Linux than the one you run it on, and needs a newer glibc than your system has.

SIGSEGVLinux

Segmentation fault (core dumped)

A program accessed memory it wasn’t allowed to, and the kernel killed it with SIGSEGV (exit code 139).

Unexpectedly found niliOS

Fatal error: Unexpectedly found nil while unwrapping an Optional value

Swift force-unwrapped (`!`) an optional that was nil, crashing the app.

recovery modePostgreSQL

FATAL: the database system is in recovery mode

PostgreSQL crashed (often OOM-killed) and is replaying WAL to recover.

CrashLoopBackOffKubernetes

Kubernetes: CrashLoopBackOff

The container starts, crashes (or exits), and Kubernetes keeps restarting it with increasing back-off delays.

ImagePullBackOffKubernetes

Kubernetes: ImagePullBackOff / ErrImagePull

The node can’t pull the container image — wrong name/tag, missing registry credentials, or registry unreachable.

command not foundLinux

bash: command not found

The shell can’t find an executable with that name in any directory on your PATH.

ATSiOS

App Transport Security has blocked a cleartext HTTP resource load

iOS blocked an `http://` request (or a weak-TLS HTTPS one) because App Transport Security requires secure connections.

SIGABRTiOS

Thread 1: signal SIGABRT (app crashes with "libc++abi: terminating")

The app deliberately aborted — an uncaught exception, failed assertion or fatalError. The console above the crash has the real me…

Main Thread CheckeriOS

Main Thread Checker: UI API called on a background thread: -[UIView setNeedsLayout]

UIKit was used from a background thread; UI must only be touched on the main thread.

Could not cast value of typeiOS

Swift: Could not cast value of type 'X' to 'Y'

A force cast (as!) failed because the object isn’t the expected type.

integrity could not be verifiediOS

Unable to Install "App": This app cannot be installed because its integrity could not be verified

iOS rejected the app because its signature doesn’t validate for this device — expired/revoked certificate, ad-hoc profile without…

Cannot convert value of typeiOS

Swift: Cannot convert value of type 'X' to expected argument type 'Y'

The value’s type doesn’t match what the function or property expects.

ELIFECYCLEnpm

npm ERR! code ELIFECYCLE / Command failed with exit code 1

An npm script (build, start, test, postinstall) exited with an error. ELIFECYCLE is only the wrapper — the real error is printed…

gyp ERR!npm

gyp ERR! build error / node-gyp rebuild failed

A dependency with native C/C++ code couldn’t compile — missing build tools, Python, or an unsupported Node version.

COPY failedDocker

COPY failed: file not found in build context / "/app/x": not found

The Dockerfile COPY refers to a path outside the build context, excluded by .dockerignore, or relative to the wrong directory.

pull access deniedDocker

pull access denied for image, repository does not exist or may require 'docker login'

Docker couldn’t pull the image: the name or tag is wrong, the repository is private and you’re not logged in, or it doesn’t exist…

manifest unknownDocker

manifest for image:tag not found: manifest unknown

The repository exists, but the tag you asked for doesn’t — it was never pushed, was deleted, or is misspelled.

conflict: unable to remove repository referenceDocker

conflict: unable to remove repository reference (must force) - container is using its referenced image

You tried to delete an image that a container — even a stopped one — still uses.

Signing requires a development teamiOS

Signing for "App" requires a development team. Select a development team in the Signing & Capabilities editor

No Apple developer team is selected for the target, so Xcode can’t sign the app.

No such moduleiOS

Swift: No such module 'X' (module not found)

Xcode can’t find a Swift package, pod or framework you import.

dyld: Library not loadediOS

dyld: Library not loaded: @rpath/X.framework/X — Reason: image not found (crash on launch)

A dynamic framework the app needs at runtime isn’t embedded in the app bundle, so it crashes at launch.

PhaseScriptExecutioniOS

Xcode: Command PhaseScriptExecution failed with a nonzero exit code

A Run Script build phase (CocoaPods, React Native, Flutter, SwiftLint, Crashlytics…) failed. The real error is above this line in…

CocoaPods compatible versionsiOS

CocoaPods could not find compatible versions for pod

pod install can’t satisfy the version constraints — outdated spec repo, a higher deployment target required, or two pods needing…

CDN: trunk URL couldn't be downloadediOS

[!] CDN: trunk URL couldn't be downloaded: https://cdn.cocoapods.org/...

CocoaPods couldn’t reach its CDN spec repo — network/proxy issues, rate limiting, or an outdated CocoaPods.

ITMS-90683iOS

ITMS-90683: Missing purpose string in Info.plist (NSCameraUsageDescription etc.)

The binary references a privacy-sensitive API, but Info.plist lacks the matching usage description.

attempted to access privacy-sensitive data without a usage descriptioniOS

This app has crashed because it attempted to access privacy-sensitive data without a usage description

The app requested camera, photos, microphone, location, contacts, etc. without the required NS…UsageDescription in Info.plist, so…