Error map

incompatible data directory FATAL: database files are incompatible with server — The data directory was initialized by PostgreSQL version 15, which is not compatible with this version 16

PostgreSQL · layer 5, Data

Open the full error page →

Centre: this error. First ring: errors it is linked with (12). Outer ring: what those are linked with. Colours show the layer of a request each error belongs to. Click any dot to re-centre the map on it; hover to follow its connections. The centre dot opens the error page.

incompatible data directory — FATAL: database files are incompatible with server — The data directory was initialized by PostgreSQL version 15, which is not compatible with this version 16 (PostgreSQL)incompatibl…caching_sha2_password — Authentication plugin 'caching_sha2_password' cannot be loaded (MySQL)caching_sha2_passwo…57P03 — FATAL: the database system is starting up (PostgreSQL)57P03incompatible version of Kotlin — Module was compiled with an incompatible version of Kotlin. The binary version of its metadata is 2.0.0, expected version is 1.8.0 (Android)incompatible versio…invalid ELF header — Error: /app/node_modules/bcrypt/lib/binding/bcrypt_lib.node: invalid ELF header (npm)invalid ELF headerCorepack keyid — Error: Cannot find matching keyid (Corepack signature verification) (npm)Corepack keyid0xC1900101 — Windows upgrade error 0xC1900101 (driver error, rolled back) (Windows)0xC1900101sharp module — Error: Could not load the "sharp" module using the linux-x64 runtime (npm)sharp moduleesbuild wrong platform — You installed esbuild for another platform than the one you're currently using. (npm)esbuild wrong platf…data directory permissions — FATAL: data directory "/var/lib/postgresql/data" has invalid permissions — Permissions should be u=rwx (0700) or u=rwx,g=rx (0750). (PostgreSQL)data directory perm…GLIBC_2.xx not found — /lib/x86_64-linux-gnu/libc.so.6: version `GLIBC_2.34' not found (Linux)GLIBC_2.xx not foundMinimum supported Gradle version — Minimum supported Gradle version is 8.7. Current version is 8.2 (Android)Minimum supported G…cb() never called — npm ERR! cb() never called! (npm)cb() never called1045 — MySQL ERROR 1045 (28000): Access denied for user (MySQL)10451130 — MySQL ERROR 1130 (HY000): Host 'x' is not allowed to connect to this MySQL server (MySQL)11301698 — MySQL ERROR 1698 (28000): Access denied for user 'root'@'localhost' (MySQL)1698500.30 — HTTP Error 500.30 - ASP.NET Core app failed to start (.NET)500.30ExceptionInInitializerError — java.lang.ExceptionInInitializerError (Java)ExceptionInInitiali…MySQL won't start — Job for mysql.service failed because the control process exited with error code (MySQL)MySQL won't startUnsupported class file major version — Gradle: Unsupported class file major version / Android Gradle plugin requires Java 17 to run (Android)Unsupported class f…old lockfile — npm WARN old lockfile — The package-lock.json file was created with an old version of npm, so supplemental metadata must be fetched (npm)old lockfileconfig global deprecated — npm WARN config global `--global`, `--local` are deprecated. Use `--location=global` instead. (npm)config global depre…gyp ERR! — gyp ERR! build error / node-gyp rebuild failed (npm)gyp ERR!No Xcode or CLT — gyp: No Xcode or CLT version detected! (npm)No Xcode or CLTrollup native module — Error: Cannot find module @rollup/rollup-linux-x64-gnu. npm has a bug related to optional dependencies (npm)rollup native moduleEPUBLISHCONFLICT — npm ERR! 403 — You cannot publish over the previously published versions: 1.2.3 (npm)EPUBLISHCONFLICTnpx executable — npm ERR! could not determine executable to run (npm)npx executableMissing script — npm ERR! Missing script: "start" (npm)Missing script0x80070005 — Windows Error 0x80070005 (E_ACCESSDENIED): Access is denied (Windows)0x800700050x80070002 — Windows Error 0x80070002: The system cannot find the file specified (Windows)0x80070002IRQL_NOT_LESS_OR_EQUAL — Blue Screen: IRQL_NOT_LESS_OR_EQUAL (Stop code 0x0000000A) (Windows)IRQL_NOT_LESS_OR_EQ…daemon — Cannot connect to the Docker daemon at unix:///var/run/docker.sock. Is the docker daemon running? (Docker)daemonEACCES — Linux: Permission denied (Linux)EACCES403 — HTTP 403 Forbidden (HTTP)403numpy alias removed — AttributeError: module 'numpy' has no attribute 'float' (Python)numpy alias removedNo module named distutils — ModuleNotFoundError: No module named 'distutils' (Python)No module named dis…defaultProps deprecated — Warning: Support for defaultProps will be removed from function components in a future major release. (React)defaultProps deprec…findDOMNode deprecated — Warning: findDOMNode is deprecated and will be removed in the next major release. (React)findDOMNode depreca…no matches for kind — no matches for kind "Ingress" in version "extensions/v1beta1" (resource mapping not found) (Kubernetes)no matches for kindNamespace not specified — Namespace not specified. Specify a namespace in the module's build file (AGP 8) (Android)Namespace not speci…EINTEGRITY — npm ERR! code EINTEGRITY — sha512 integrity checksum failed (npm)EINTEGRITYENOSPC — Error: ENOSPC: System limit for number of file watchers reached (npm)ENOSPCE402 — npm ERR! code E402 — 402 Payment Required - PUT https://registry.npmjs.org/@scope%2fpkg - You must sign up for private packages (npm)E402

Directly related (12)

caching_sha2_passwordMySQL

Authentication plugin 'caching_sha2_password' cannot be loaded

An old MySQL client/driver can’t use MySQL 8’s default authentication plugin.

57P03PostgreSQL

FATAL: the database system is starting up

PostgreSQL is still starting (or recovering) and not accepting connections yet.

incompatible version of KotlinAndroid

Module was compiled with an incompatible version of Kotlin. The binary version of its metadata is 2.0.0, expected version is 1.8.0

A dependency was compiled with a newer Kotlin version than your project’s Kotlin Gradle plugin can read.

invalid ELF headernpm

Error: /app/node_modules/bcrypt/lib/binding/bcrypt_lib.node: invalid ELF header

A native module compiled for macOS/Windows is being loaded on Linux.

Corepack keyidnpm

Error: Cannot find matching keyid (Corepack signature verification)

An older Corepack couldn’t verify the signature of a newly published pnpm/yarn release after npm rotated its signing keys.

0xC1900101Windows

Windows upgrade error 0xC1900101 (driver error, rolled back)

A Windows feature update failed and rolled back because a driver crashed or was incompatible during installation.

sharp modulenpm

Error: Could not load the "sharp" module using the linux-x64 runtime

sharp’s native binary for this OS/CPU isn’t installed — usually node_modules installed on another platform (Mac → Linux/Docker).

esbuild wrong platformnpm

You installed esbuild for another platform than the one you're currently using.

node_modules contains esbuild’s binary for a different OS/CPU.

data directory permissionsPostgreSQL

FATAL: data directory "/var/lib/postgresql/data" has invalid permissions — Permissions should be u=rwx (0700) or u=rwx,g=rx (0750).

PostgreSQL refuses to start because the data directory is too open or owned by the wrong user.

GLIBC_2.xx not foundLinux

/lib/x86_64-linux-gnu/libc.so.6: version `GLIBC_2.34' not found

The binary was built on a newer Linux than the one you run it on, and needs a newer glibc than your system has.

Minimum supported Gradle versionAndroid

Minimum supported Gradle version is 8.7. Current version is 8.2

The Android Gradle Plugin (AGP) version in your build needs a newer Gradle wrapper version.

cb() never callednpm

npm ERR! cb() never called!

An old npm crash during install — usually network/cache corruption.

Two steps away (30)

1045MySQL

MySQL ERROR 1045 (28000): Access denied for user

MySQL rejected the login — wrong password, wrong user/host combination, or the user doesn’t exist.

1130MySQL

MySQL ERROR 1130 (HY000): Host 'x' is not allowed to connect to this MySQL server

No MySQL account exists for the host you’re connecting from.

1698MySQL

MySQL ERROR 1698 (28000): Access denied for user 'root'@'localhost'

root uses the auth_socket/unix_socket plugin (Ubuntu/Debian default), so password logins as root fail.

500.30.NET

HTTP Error 500.30 - ASP.NET Core app failed to start

IIS/Azure’s ASP.NET Core Module launched your app but it crashed during startup.

ExceptionInInitializerErrorJava

java.lang.ExceptionInInitializerError

A static initializer (static block or static field) threw an exception while the class was loading.

MySQL won't startMySQL

Job for mysql.service failed because the control process exited with error code

The MySQL/MariaDB service failed to start — the real reason is in the MySQL error log.

Unsupported class file major versionAndroid

Gradle: Unsupported class file major version / Android Gradle plugin requires Java 17 to run

The JDK running Gradle doesn’t match what the Gradle version or Android Gradle Plugin (AGP) supports.

old lockfilenpm

npm WARN old lockfile — The package-lock.json file was created with an old version of npm, so supplemental metadata must be fetched

The lockfile is lockfileVersion 1 (npm 6) and npm 7+ is upgrading it.

config global deprecatednpm

npm WARN config global `--global`, `--local` are deprecated. Use `--location=global` instead.

A deprecation warning printed by npm 8.11–8.12 for the --global flag.

gyp ERR!npm

gyp ERR! build error / node-gyp rebuild failed

A dependency with native C/C++ code couldn’t compile — missing build tools, Python, or an unsupported Node version.

No Xcode or CLTnpm

gyp: No Xcode or CLT version detected!

node-gyp on macOS can’t find the Xcode Command Line Tools to compile native modules.

rollup native modulenpm

Error: Cannot find module @rollup/rollup-linux-x64-gnu. npm has a bug related to optional dependencies

Rollup’s (and Vite’s) platform-specific optional dependency wasn’t installed — an npm optional-dependency bug with lockfiles from…

EPUBLISHCONFLICTnpm

npm ERR! 403 — You cannot publish over the previously published versions: 1.2.3

That version number has already been published (or unpublished) and can’t be reused.

npx executablenpm

npm ERR! could not determine executable to run

npx couldn’t find a binary to run for that package.

Missing scriptnpm

npm ERR! Missing script: "start"

The script name you ran isn’t defined in package.json "scripts".

0x80070005Windows

Windows Error 0x80070005 (E_ACCESSDENIED): Access is denied

Windows refused an operation because the account or process lacks permission — seen in Windows Update, installers, Task Scheduler…

0x80070002Windows

Windows Error 0x80070002: The system cannot find the file specified

A file or registry entry Windows expected is missing — common in Windows Update, backups and app installs.

IRQL_NOT_LESS_OR_EQUALWindows

Blue Screen: IRQL_NOT_LESS_OR_EQUAL (Stop code 0x0000000A)

A driver accessed memory at an interrupt level where that’s not allowed — almost always a faulty or incompatible driver, sometime…

daemonDocker

Cannot connect to the Docker daemon at unix:///var/run/docker.sock. Is the docker daemon running?

The docker CLI can’t talk to the Docker engine — it isn’t running, or your user can’t access the socket.

EACCESLinux

Linux: Permission denied

Your user (or the service user) lacks read/write/execute permission on a file, directory or one of its parents.

403HTTP

HTTP 403 Forbidden

The server understood the request but refuses to authorize it — you (or the server process) are not allowed to access this resour…

numpy alias removedPython

AttributeError: module 'numpy' has no attribute 'float'

Code uses np.float/np.int/np.bool/np.object, which were removed in NumPy 1.24.

No module named distutilsPython

ModuleNotFoundError: No module named 'distutils'

Python 3.12 removed distutils; old packages or tools that import it fail.

defaultProps deprecatedReact

Warning: Support for defaultProps will be removed from function components in a future major release.

A function component (often inside a library) uses Component.defaultProps.

findDOMNode deprecatedReact

Warning: findDOMNode is deprecated and will be removed in the next major release.

A component (often an old library like react-transition-group v1, react-draggable) uses findDOMNode, which StrictMode flags and R…

no matches for kindKubernetes

no matches for kind "Ingress" in version "extensions/v1beta1" (resource mapping not found)

The manifest uses an apiVersion/kind the cluster doesn’t serve — a removed beta API, or a CRD that isn’t installed.

Namespace not specifiedAndroid

Namespace not specified. Specify a namespace in the module's build file (AGP 8)

AGP 8 requires android { namespace = "…" } in each module’s build file; the package attribute in AndroidManifest.xml is no longer…

EINTEGRITYnpm

npm ERR! code EINTEGRITY — sha512 integrity checksum failed

A downloaded package’s hash doesn’t match the integrity value in package-lock.json — a corrupted cache, a changed tarball, or a l…

ENOSPCnpm

Error: ENOSPC: System limit for number of file watchers reached

Linux ran out of inotify watches — dev servers watching large projects hit the limit.

E402npm

npm ERR! code E402 — 402 Payment Required - PUT https://registry.npmjs.org/@scope%2fpkg - You must sign up for private packages

You published a scoped package without --access public, so npm tried to publish it as private.