Error map

No module named distutils ModuleNotFoundError: No module named 'distutils'

Python · layer 4, Application & API

Open the full error page →

Centre: this error. First ring: errors it is linked with (12). Outer ring: what those are linked with. Colours show the layer of a request each error belongs to. Click any dot to re-centre the map on it; hover to follow its connections. The centre dot opens the error page.

No module named distutils — ModuleNotFoundError: No module named 'distutils' (Python)No module n…ModuleNotFoundError — ModuleNotFoundError: No module named 'x' (Python)ModuleNotFoundErrorgyp ERR! — gyp ERR! build error / node-gyp rebuild failed (npm)gyp ERR!Could not resolve — Gradle: Could not resolve all files for configuration / Could not resolve dependency (Android)Could not resolveImportError — ImportError: cannot import name 'x' from 'y' (Python)ImportErrorpip no matching distribution — ERROR: Could not find a version that satisfies the requirement x (from versions: none) (Python)pip no matching dis…incompatible version of Kotlin — Module was compiled with an incompatible version of Kotlin. The binary version of its metadata is 2.0.0, expected version is 1.8.0 (Android)incompatible versio…0xC1900101 — Windows upgrade error 0xC1900101 (driver error, rolled back) (Windows)0xC19001010x8007007E — 0x8007007E: The specified module could not be found (Windows)0x8007007EDuplicate class — Duplicate class X found in modules A and B (Android)Duplicate classnumpy alias removed — AttributeError: module 'numpy' has no attribute 'float' (Python)numpy alias removedRuntime.ImportModuleError — Runtime.ImportModuleError: Unable to import module 'lambda_function': No module named 'x' (AWS)Runtime.ImportModul…GLIBC_2.xx not found — /lib/x86_64-linux-gnu/libc.so.6: version `GLIBC_2.34' not found (Linux)GLIBC_2.xx not foundMODULE_NOT_FOUND — Error: Cannot find module 'x' (MODULE_NOT_FOUND) (Node.js)MODULE_NOT_FOUNDClass not found — PHP Fatal error: Uncaught Error: Class "X" not found (PHP)Class not foundNameError — NameError: name 'x' is not defined (Python)NameErrorELIFECYCLE — npm ERR! code ELIFECYCLE / Command failed with exit code 1 (npm)ELIFECYCLEERR_OSSL_EVP_UNSUPPORTED — Error: error:0308010C:digital envelope routines::unsupported (Node.js)ERR_OSSL_EVP_UNSUPP…node-sass — Error: Node Sass does not yet support your current environment (Node.js)node-sassINSTALL_FAILED_UPDATE_INCOMPATIBLE — Android: INSTALL_FAILED_UPDATE_INCOMPATIBLE (Android)INSTALL_FAILED_UPDA…ClassNotFoundException — java.lang.ClassNotFoundException / NoClassDefFoundError (Java)ClassNotFoundExcept…Manifest merger failed — Manifest merger failed: android:exported needs to be explicitly specified (Android)Manifest merger fai…AttributeError — AttributeError: 'X' object has no attribute 'y' (Python)AttributeErrorMaven resolve — [ERROR] Failed to execute goal on project x: Could not resolve dependencies for project (Java)Maven resolveheld broken packages — Unmet dependencies / E: Unable to correct problems, you have held broken packages (Linux)held broken packagesE404 — npm ERR! code E404 — 404 Not Found: package@version is not in this registry (npm)E404externally-managed-environment — error: externally-managed-environment (Python)externally-managed-…Failed building wheel — error: subprocess-exited-with-error / Failed building wheel for x (Python)Failed building whe…Unsupported class file major version — Gradle: Unsupported class file major version / Android Gradle plugin requires Java 17 to run (Android)Unsupported class f…caching_sha2_password — Authentication plugin 'caching_sha2_password' cannot be loaded (MySQL)caching_sha2_passwo…old lockfile — npm WARN old lockfile — The package-lock.json file was created with an old version of npm, so supplemental metadata must be fetched (npm)old lockfile0x80070005 — Windows Error 0x80070005 (E_ACCESSDENIED): Access is denied (Windows)0x800700050x80070002 — Windows Error 0x80070002: The system cannot find the file specified (Windows)0x80070002IRQL_NOT_LESS_OR_EQUAL — Blue Screen: IRQL_NOT_LESS_OR_EQUAL (Stop code 0x0000000A) (Windows)IRQL_NOT_LESS_OR_EQ…ERESOLVE — npm ERR! code ERESOLVE — unable to resolve dependency tree (npm)ERESOLVE0xC000007B — The application was unable to start correctly (0xc000007b) (Windows)0xC000007BVCRUNTIME140.dll — VCRUNTIME140.dll was not found / MSVCP140.dll is missing (Windows)VCRUNTIME140.dllNoSuchMethodError — java.lang.NoSuchMethodError (Java)NoSuchMethodErrorGradle wrapper main class — Error: Could not find or load main class org.gradle.wrapper.GradleWrapperMain (Java)Gradle wrapper main…EBADENGINE — npm WARN EBADENGINE Unsupported engine / The engine "node" is incompatible with this module (Node.js)EBADENGINEcb() never called — npm ERR! cb() never called! (npm)cb() never calledCorepack keyid — Error: Cannot find matching keyid (Corepack signature verification) (npm)Corepack keyidValueError ambiguous truth — ValueError: The truth value of a Series is ambiguous. Use a.empty, a.bool(), a.item(), a.any() or a.all(). (Python)ValueError ambiguou…CocoaPods compatible versions — CocoaPods could not find compatible versions for pod (iOS)CocoaPods compatibl…ERR_PACKAGE_PATH_NOT_EXPORTED — Error [ERR_PACKAGE_PATH_NOT_EXPORTED]: Package subpath './x' is not defined by "exports" (Node.js)ERR_PACKAGE_PATH_NO…DEP0040 — DeprecationWarning: The `punycode` module is deprecated (DEP0040) (Node.js)DEP0040config global deprecated — npm WARN config global `--global`, `--local` are deprecated. Use `--location=global` instead. (npm)config global depre…incompatible data directory — FATAL: database files are incompatible with server — The data directory was initialized by PostgreSQL version 15, which is not compatible with this version 16 (PostgreSQL)incompatible data d…defaultProps deprecated — Warning: Support for defaultProps will be removed from function components in a future major release. (React)defaultProps deprec…

Directly related (12)

ModuleNotFoundErrorPython

ModuleNotFoundError: No module named 'x'

Python can’t find the module you import — it isn’t installed in the interpreter/virtualenv that’s running, or the import path is…

gyp ERR!npm

gyp ERR! build error / node-gyp rebuild failed

A dependency with native C/C++ code couldn’t compile — missing build tools, Python, or an unsupported Node version.

Could not resolveAndroid

Gradle: Could not resolve all files for configuration / Could not resolve dependency

Gradle couldn’t download a dependency — wrong coordinates/version, missing repository, offline mode, or network/proxy issues.

ImportErrorPython

ImportError: cannot import name 'x' from 'y'

The module was found, but the name you’re importing from it doesn’t exist — usually a version change or a circular import.

pip no matching distributionPython

ERROR: Could not find a version that satisfies the requirement x (from versions: none)

pip found no installable version of the package for your Python version, OS or index.

incompatible version of KotlinAndroid

Module was compiled with an incompatible version of Kotlin. The binary version of its metadata is 2.0.0, expected version is 1.8.0

A dependency was compiled with a newer Kotlin version than your project’s Kotlin Gradle plugin can read.

0xC1900101Windows

Windows upgrade error 0xC1900101 (driver error, rolled back)

A Windows feature update failed and rolled back because a driver crashed or was incompatible during installation.

0x8007007EWindows

0x8007007E: The specified module could not be found

A DLL that a program, driver or COM component needs isn’t on disk or on the DLL search path.

Duplicate classAndroid

Duplicate class X found in modules A and B

Two dependencies ship the same class — typically old Android Support libraries mixed with AndroidX, or Kotlin stdlib-jdk7/jdk8 ve…

numpy alias removedPython

AttributeError: module 'numpy' has no attribute 'float'

Code uses np.float/np.int/np.bool/np.object, which were removed in NumPy 1.24.

Runtime.ImportModuleErrorAWS

Runtime.ImportModuleError: Unable to import module 'lambda_function': No module named 'x'

Lambda couldn’t load your handler file or one of its dependencies — the package is missing from the deployment zip/layer or the h…

GLIBC_2.xx not foundLinux

/lib/x86_64-linux-gnu/libc.so.6: version `GLIBC_2.34' not found

The binary was built on a newer Linux than the one you run it on, and needs a newer glibc than your system has.

Two steps away (36)

MODULE_NOT_FOUNDNode.js

Error: Cannot find module 'x' (MODULE_NOT_FOUND)

Node can’t resolve the module path — the package isn’t installed, or a relative path/extension is wrong.

Class not foundPHP

PHP Fatal error: Uncaught Error: Class "X" not found

PHP couldn’t load the class — autoloading failed, the namespace is wrong, or the dependency isn’t installed.

NameErrorPython

NameError: name 'x' is not defined

Python doesn’t know the name — it was never assigned/imported in this scope, or it’s misspelled.

ELIFECYCLEnpm

npm ERR! code ELIFECYCLE / Command failed with exit code 1

An npm script (build, start, test, postinstall) exited with an error. ELIFECYCLE is only the wrapper — the real error is printed…

ERR_OSSL_EVP_UNSUPPORTEDNode.js

Error: error:0308010C:digital envelope routines::unsupported

An old build tool (webpack 4, old react-scripts) uses a hash algorithm that OpenSSL 3 in Node 17+ disables.

node-sassNode.js

Error: Node Sass does not yet support your current environment

node-sass (deprecated) has no binary for your Node version/OS.

INSTALL_FAILED_UPDATE_INCOMPATIBLEAndroid

Android: INSTALL_FAILED_UPDATE_INCOMPATIBLE

An app with the same package name but a different signing key is already installed on the device.

ClassNotFoundExceptionJava

java.lang.ClassNotFoundException / NoClassDefFoundError

The JVM couldn’t find a class on the classpath at runtime.

Manifest merger failedAndroid

Manifest merger failed: android:exported needs to be explicitly specified

Targeting Android 12 (API 31)+ requires `android:exported` on every activity, service or receiver that has an intent-filter.

AttributeErrorPython

AttributeError: 'X' object has no attribute 'y'

You accessed an attribute or method that doesn’t exist on that object type.

Maven resolveJava

[ERROR] Failed to execute goal on project x: Could not resolve dependencies for project

Maven couldn’t download or find one or more dependencies.

held broken packagesLinux

Unmet dependencies / E: Unable to correct problems, you have held broken packages

apt can’t find a set of package versions that satisfies all dependencies — usually mixed repositories or a package from another r…

E404npm

npm ERR! code E404 — 404 Not Found: package@version is not in this registry

npm asked the registry for a package (or version) that doesn’t exist there — a typo, a private/scoped package without auth, or th…

externally-managed-environmentPython

error: externally-managed-environment

Your system Python (Debian 12+, Ubuntu 23.04+, Homebrew) refuses pip installs into the OS-managed environment (PEP 668).

Failed building wheelPython

error: subprocess-exited-with-error / Failed building wheel for x

pip had to compile a package from source and the build failed — missing compiler, headers or system libraries.

Unsupported class file major versionAndroid

Gradle: Unsupported class file major version / Android Gradle plugin requires Java 17 to run

The JDK running Gradle doesn’t match what the Gradle version or Android Gradle Plugin (AGP) supports.

caching_sha2_passwordMySQL

Authentication plugin 'caching_sha2_password' cannot be loaded

An old MySQL client/driver can’t use MySQL 8’s default authentication plugin.

old lockfilenpm

npm WARN old lockfile — The package-lock.json file was created with an old version of npm, so supplemental metadata must be fetched

The lockfile is lockfileVersion 1 (npm 6) and npm 7+ is upgrading it.

0x80070005Windows

Windows Error 0x80070005 (E_ACCESSDENIED): Access is denied

Windows refused an operation because the account or process lacks permission — seen in Windows Update, installers, Task Scheduler…

0x80070002Windows

Windows Error 0x80070002: The system cannot find the file specified

A file or registry entry Windows expected is missing — common in Windows Update, backups and app installs.

IRQL_NOT_LESS_OR_EQUALWindows

Blue Screen: IRQL_NOT_LESS_OR_EQUAL (Stop code 0x0000000A)

A driver accessed memory at an interrupt level where that’s not allowed — almost always a faulty or incompatible driver, sometime…

ERESOLVEnpm

npm ERR! code ERESOLVE — unable to resolve dependency tree

npm 7+ found conflicting peer dependency requirements and refuses to install a broken tree.

0xC000007BWindows

The application was unable to start correctly (0xc000007b)

A program loaded a DLL of the wrong architecture (32-bit vs 64-bit) or a corrupted runtime library.

VCRUNTIME140.dllWindows

VCRUNTIME140.dll was not found / MSVCP140.dll is missing

The program needs the Microsoft Visual C++ 2015–2022 Redistributable, which isn’t installed (or is damaged).

NoSuchMethodErrorJava

java.lang.NoSuchMethodError

Code compiled against one version of a library is running with another version where the method doesn’t exist.

Gradle wrapper main classJava

Error: Could not find or load main class org.gradle.wrapper.GradleWrapperMain

The Gradle wrapper JAR (gradle/wrapper/gradle-wrapper.jar) is missing or corrupt.

EBADENGINENode.js

npm WARN EBADENGINE Unsupported engine / The engine "node" is incompatible with this module

A package requires a different Node.js version than the one you’re running.

cb() never callednpm

npm ERR! cb() never called!

An old npm crash during install — usually network/cache corruption.

Corepack keyidnpm

Error: Cannot find matching keyid (Corepack signature verification)

An older Corepack couldn’t verify the signature of a newly published pnpm/yarn release after npm rotated its signing keys.

ValueError ambiguous truthPython

ValueError: The truth value of a Series is ambiguous. Use a.empty, a.bool(), a.item(), a.any() or a.all().

A pandas Series/NumPy array was used where Python expects a single True/False (if, and, or).

CocoaPods compatible versionsiOS

CocoaPods could not find compatible versions for pod

pod install can’t satisfy the version constraints — outdated spec repo, a higher deployment target required, or two pods needing…

ERR_PACKAGE_PATH_NOT_EXPORTEDNode.js

Error [ERR_PACKAGE_PATH_NOT_EXPORTED]: Package subpath './x' is not defined by "exports"

You imported a deep path inside a package that its package.json "exports" field doesn’t expose.

DEP0040Node.js

DeprecationWarning: The `punycode` module is deprecated (DEP0040)

A dependency imports Node’s built-in punycode module, deprecated since Node 21.

config global deprecatednpm

npm WARN config global `--global`, `--local` are deprecated. Use `--location=global` instead.

A deprecation warning printed by npm 8.11–8.12 for the --global flag.

incompatible data directoryPostgreSQL

FATAL: database files are incompatible with server — The data directory was initialized by PostgreSQL version 15, which is not compatible with this version 16

A newer (or older) PostgreSQL major version was started on an existing data directory.

defaultProps deprecatedReact

Warning: Support for defaultProps will be removed from function components in a future major release.

A function component (often inside a library) uses Component.defaultProps.