Error map
npx executable npm ERR! could not determine executable to run
npm · layer 7, Build & delivery
Centre: this error. First ring: errors it is linked with (7). Outer ring: what those are linked with. Colours show the layer of a request each error belongs to. Click any dot to re-centre the map on it; hover to follow its connections. The centre dot opens the error page.
Directly related (7)
[nodemon] app crashed - waiting for file changes before starting...
Your app threw an error on startup; nodemon is waiting for a file change to retry.
pg_dump: error: aborting because of server version mismatch
Your pg_dump client is older than the server you’re dumping.
pg_restore: error: input file appears to be a text format dump. Please use psql.
A plain .sql dump was given to pg_restore, which only reads custom/directory/tar formats.
Error: Cannot find matching keyid (Corepack signature verification)
An older Corepack couldn’t verify the signature of a newly published pnpm/yarn release after npm rotated its signing keys.
npm ERR! code E401 — Unable to authenticate, need: Basic realm / Incorrect or missing password
The registry rejected your credentials — missing, expired or wrong auth token.
'react-scripts' is not recognized as an internal or external command / react-scripts: command not found
node_modules is missing or broken, so the react-scripts binary isn’t available.
npm ERR! cb() never called!
An old npm crash during install — usually network/cache corruption.
Two steps away (18)
Error: Cannot find module 'x' (MODULE_NOT_FOUND)
Node can’t resolve the module path — the package isn’t installed, or a relative path/extension is wrong.
Error: listen EADDRINUSE: address already in use :::3000
Another process is already listening on that port.
HTTP Error 500.30 - ASP.NET Core app failed to start
IIS/Azure’s ASP.NET Core Module launched your app but it crashed during startup.
ERROR: canceling statement due to statement timeout
A query ran longer than statement_timeout and PostgreSQL cancelled it.
ERROR: cannot drop table x because other objects depend on it
Views, foreign keys or other objects depend on what you’re dropping.
ERROR: bind message supplies 2 parameters, but prepared statement requires 1
The number of query parameters sent doesn’t match the $1, $2 … placeholders in the SQL.
Authentication plugin 'caching_sha2_password' cannot be loaded
An old MySQL client/driver can’t use MySQL 8’s default authentication plugin.
npm ERR! 403 — You cannot publish over the previously published versions: 1.2.3
That version number has already been published (or unpublished) and can’t be reused.
npm WARN old lockfile — The package-lock.json file was created with an old version of npm, so supplemental metadata must be fetched
The lockfile is lockfileVersion 1 (npm 6) and npm 7+ is upgrading it.
HTTP 401 Unauthorized
The request has no valid authentication credentials — you need to log in or send a valid token.
npm ERR! code E404 — 404 Not Found: package@version is not in this registry
npm asked the registry for a package (or version) that doesn’t exist there — a typo, a private/scoped package without auth, or th…
npm ERR! code ETARGET — No matching version found for package@^9.9.9
The version range in package.json doesn’t match any published version of the package.
bash: command not found
The shell can’t find an executable with that name in any directory on your PATH.
COPY failed: file not found in build context / "/app/x": not found
The Dockerfile COPY refers to a path outside the build context, excluded by .dockerignore, or relative to the wrong directory.
Error: Could not find or load main class org.gradle.wrapper.GradleWrapperMain
The Gradle wrapper JAR (gradle/wrapper/gradle-wrapper.jar) is missing or corrupt.
npm ERR! code EINTEGRITY — sha512 integrity checksum failed
A downloaded package’s hash doesn’t match the integrity value in package-lock.json — a corrupted cache, a changed tarball, or a l…
npm ERR! Missing script: "start"
The script name you ran isn’t defined in package.json "scripts".
Error: ENOSPC: System limit for number of file watchers reached
Linux ran out of inotify watches — dev servers watching large projects hit the limit.
Map another error
Popular: 4035004000xC000007BTypeErrorCritical error404NullPointerException