Error map
pg_dump version mismatch pg_dump: error: aborting because of server version mismatch
PostgreSQL · layer 5, Data
Centre: this error. First ring: errors it is linked with (7). Outer ring: what those are linked with. Colours show the layer of a request each error belongs to. Click any dot to re-centre the map on it; hover to follow its connections. The centre dot opens the error page.
Directly related (7)
[nodemon] app crashed - waiting for file changes before starting...
Your app threw an error on startup; nodemon is waiting for a file change to retry.
ERROR: canceling statement due to statement timeout
A query ran longer than statement_timeout and PostgreSQL cancelled it.
pg_restore: error: input file appears to be a text format dump. Please use psql.
A plain .sql dump was given to pg_restore, which only reads custom/directory/tar formats.
'react-scripts' is not recognized as an internal or external command / react-scripts: command not found
node_modules is missing or broken, so the react-scripts binary isn’t available.
npm ERR! could not determine executable to run
npx couldn’t find a binary to run for that package.
ERROR: cannot drop table x because other objects depend on it
Views, foreign keys or other objects depend on what you’re dropping.
ERROR: bind message supplies 2 parameters, but prepared statement requires 1
The number of query parameters sent doesn’t match the $1, $2 … placeholders in the SQL.
Two steps away (18)
Error: Cannot find module 'x' (MODULE_NOT_FOUND)
Node can’t resolve the module path — the package isn’t installed, or a relative path/extension is wrong.
Error: listen EADDRINUSE: address already in use :::3000
Another process is already listening on that port.
HTTP Error 500.30 - ASP.NET Core app failed to start
IIS/Azure’s ASP.NET Core Module launched your app but it crashed during startup.
HTTP 504 Gateway Timeout
A proxy or gateway waited too long for the upstream server to respond and gave up.
Cloudflare Error 524: A Timeout Occurred
Cloudflare connected to the origin, but the origin didn’t send an HTTP response within 100 seconds.
HTTP 304 Not Modified
The cached copy is still valid, so the server sends no body and the client reuses its cache.
bash: command not found
The shell can’t find an executable with that name in any directory on your PATH.
COPY failed: file not found in build context / "/app/x": not found
The Dockerfile COPY refers to a path outside the build context, excluded by .dockerignore, or relative to the wrong directory.
Error: Could not find or load main class org.gradle.wrapper.GradleWrapperMain
The Gradle wrapper JAR (gradle/wrapper/gradle-wrapper.jar) is missing or corrupt.
npm ERR! code E401 — Unable to authenticate, need: Basic realm / Incorrect or missing password
The registry rejected your credentials — missing, expired or wrong auth token.
npm ERR! cb() never called!
An old npm crash during install — usually network/cache corruption.
Error: Cannot find matching keyid (Corepack signature verification)
An older Corepack couldn’t verify the signature of a newly published pnpm/yarn release after npm rotated its signing keys.
MySQL ERROR 1146 (42S02): Table 'db.table' doesn't exist
The query references a table that MySQL can’t find in that database.
PostgreSQL: ERROR: relation "x" does not exist
The table/view isn’t found — missing migration, wrong schema, or a case-sensitive quoted name.
PostgreSQL: ERROR: column "x" does not exist
PostgreSQL can’t find the column — a missing migration, a case-sensitive quoted name, or a string literal written in double quote…
Blue Screen: IRQL_NOT_LESS_OR_EQUAL (Stop code 0x0000000A)
A driver accessed memory at an interrupt level where that’s not allowed — almost always a faulty or incompatible driver, sometime…
IncorrectResultSizeDataAccessException: query did not return a unique result: 2
A query expected one row but found several.
MySQL ERROR 1093 (HY000): You can't specify target table 'x' for update in FROM clause
An UPDATE/DELETE uses a subquery that reads from the same table, which MySQL doesn’t allow directly.
Map another error
Popular: 403500400TypeErrorCritical error0xC000007BNullPointerException404